BDBM50132787 CHEMBL3634417
SMILES: Cc1ccoc1C(=O)Nc1ccc(cc1)N1C(=O)c2cccc(F)c2C1=O
InChI Key: InChIKey=QDDMZQCENBRXHC-UHFFFAOYSA-N
Data: 1 IC50  2 EC50
Activity Spreadsheet -- Enzyme Inhibition Constant Data from BindingDB
Found 3 hits for monomerid = 50132787
Trg + Lig
Ki
nM
ΔG°
kcal/mole
IC50
nM
Kd
nM
EC50/IC50
nM
koff
s-1
kon
M-1s-1
pHTemp
°C
Metabotropic glutamate receptor 1
(Homo sapiens (Human))
BDBM50132787
(CHEMBL3634417)
Show SMILES Cc1ccoc1C(=O)Nc1ccc(cc1)N1C(=O)c2cccc(F)c2C1=O
Show InChI InChI=1S/C20H13FN2O4/c1-11-9-10-27-17(11)18(24)22-12-5-7-13(8-6-12)23-19(25)14-3-2-4-15(21)16(14)20(23)26/h2-10H,1H3,(H,22,24)
n/an/an/an/a 44n/an/an/an/a
Vanderbilt University Medical Center
Curated by ChEMBL
Assay Description
Agonist activity at human NPY4 receptor in HEK293 cells by inhibition of forskolin-stimulated cAMP synthesis
Bioorg Med Chem Lett 25: 5107-10 (2015)
BindingDB Entry DOI: 10.7270/Q20C4XKQ
Metabotropic glutamate receptor 1
(Homo sapiens (Human))
BDBM50132787
(CHEMBL3634417)
Show SMILES Cc1ccoc1C(=O)Nc1ccc(cc1)N1C(=O)c2cccc(F)c2C1=O
Show InChI InChI=1S/C20H13FN2O4/c1-11-9-10-27-17(11)18(24)22-12-5-7-13(8-6-12)23-19(25)14-3-2-4-15(21)16(14)20(23)26/h2-10H,1H3,(H,22,24)
n/an/a 44n/an/an/an/an/an/a
Vanderbilt University Medical Center
Curated by ChEMBL
Assay Description
Positive allosteric modulation of human mGluR1 by calcium mobilization assay
Bioorg Med Chem Lett 25: 5107-10 (2015)
BindingDB Entry DOI: 10.7270/Q20C4XKQ
Metabotropic glutamate receptor 4
(Homo sapiens (Human))
BDBM50132787
(CHEMBL3634417)
Show SMILES Cc1ccoc1C(=O)Nc1ccc(cc1)N1C(=O)c2cccc(F)c2C1=O
Show InChI InChI=1S/C20H13FN2O4/c1-11-9-10-27-17(11)18(24)22-12-5-7-13(8-6-12)23-19(25)14-3-2-4-15(21)16(14)20(23)26/h2-10H,1H3,(H,22,24)
n/an/an/an/a 382n/an/an/an/a
Vanderbilt University Medical Center
Curated by ChEMBL
Assay Description
Inhibition of bovine trypsin
Bioorg Med Chem Lett 25: 5107-10 (2015)
BindingDB Entry DOI: 10.7270/Q20C4XKQ