BDBM50132799 CHEMBL3634443
SMILES: Cc1ccoc1C(=O)Nc1ccc(N2C(=O)c3cccc(Cl)c3C2=O)c2ccccc12
InChI Key: InChIKey=HUMXLHHYMMLIPJ-UHFFFAOYSA-N
Data: 1 IC50  2 EC50
Activity Spreadsheet -- Enzyme Inhibition Constant Data from BindingDB
Found 3 hits for monomerid = 50132799
Trg + Lig
Ki
nM
ΔG°
kcal/mole
IC50
nM
Kd
nM
EC50/IC50
nM
koff
s-1
kon
M-1s-1
pHTemp
°C
Metabotropic glutamate receptor 1
(Homo sapiens (Human))
BDBM50132799
(CHEMBL3634443)
Show SMILES Cc1ccoc1C(=O)Nc1ccc(N2C(=O)c3cccc(Cl)c3C2=O)c2ccccc12
Show InChI InChI=1S/C24H15ClN2O4/c1-13-11-12-31-21(13)22(28)26-18-9-10-19(15-6-3-2-5-14(15)18)27-23(29)16-7-4-8-17(25)20(16)24(27)30/h2-12H,1H3,(H,26,28)
n/an/an/an/a 23n/an/an/an/a
Vanderbilt University Medical Center
Curated by ChEMBL
Assay Description
Inhibition of bovine trypsin
Bioorg Med Chem Lett 25: 5107-10 (2015)
BindingDB Entry DOI: 10.7270/Q20C4XKQ
Metabotropic glutamate receptor 4 (mGluR4)
(Homo sapiens (Human))
BDBM50132799
(CHEMBL3634443)
Show SMILES Cc1ccoc1C(=O)Nc1ccc(N2C(=O)c3cccc(Cl)c3C2=O)c2ccccc12
Show InChI InChI=1S/C24H15ClN2O4/c1-13-11-12-31-21(13)22(28)26-18-9-10-19(15-6-3-2-5-14(15)18)27-23(29)16-7-4-8-17(25)20(16)24(27)30/h2-12H,1H3,(H,26,28)
n/an/an/an/a 513n/an/an/an/a
Vanderbilt University Medical Center
Curated by ChEMBL
Assay Description
Positive allosteric modulation of human mGluR4 by calcium mobilization assay
Bioorg Med Chem Lett 25: 5107-10 (2015)
BindingDB Entry DOI: 10.7270/Q20C4XKQ
Metabotropic glutamate receptor 1
(Homo sapiens (Human))
BDBM50132799
(CHEMBL3634443)
Show SMILES Cc1ccoc1C(=O)Nc1ccc(N2C(=O)c3cccc(Cl)c3C2=O)c2ccccc12
Show InChI InChI=1S/C24H15ClN2O4/c1-13-11-12-31-21(13)22(28)26-18-9-10-19(15-6-3-2-5-14(15)18)27-23(29)16-7-4-8-17(25)20(16)24(27)30/h2-12H,1H3,(H,26,28)
n/an/a 22n/an/an/an/an/an/a
Vanderbilt University Medical Center
Curated by ChEMBL
Assay Description
Positive allosteric modulation of human mGluR1 by calcium mobilization assay
Bioorg Med Chem Lett 25: 5107-10 (2015)
BindingDB Entry DOI: 10.7270/Q20C4XKQ