null
SMILES: Cc1ccoc1C(=O)Nc1ccc(nc1)N1C(=O)c2cccc(Cl)c2C1=O
InChI Key: InChIKey=QFTWJIXNCYSAOI-UHFFFAOYSA-N
Activity Spreadsheet -- Enzyme Inhibition Constant Data from BindingDB
Found 3 hits for monomerid = 50132807
Trg + Lig
Ki
nM
ΔG°
kcal/mole
IC50
nM
Kd
nM
EC50/IC50
nM
koff
s-1
kon
M-1s-1
pHTemp
°C
Metabotropic glutamate receptor 1
(Homo sapiens (Human))
BDBM50132807
(CHEMBL3634435)
Show SMILES Cc1ccoc1C(=O)Nc1ccc(nc1)N1C(=O)c2cccc(Cl)c2C1=O
Show InChI InChI=1S/C19H12ClN3O4/c1-10-7-8-27-16(10)17(24)22-11-5-6-14(21-9-11)23-18(25)12-3-2-4-13(20)15(12)19(23)26/h2-9H,1H3,(H,22,24)
n/an/an/an/a 35n/an/an/an/a
Vanderbilt University Medical Center
Curated by ChEMBL
Assay Description
Positive allosteric modulation of human mGluR1 by calcium mobilization assay
Bioorg Med Chem Lett 25: 5107-10 (2015)
BindingDB Entry DOI: 10.7270/Q20C4XKQ
Metabotropic glutamate receptor 4
(Homo sapiens (Human))
BDBM50132807
(CHEMBL3634435)
Show SMILES Cc1ccoc1C(=O)Nc1ccc(nc1)N1C(=O)c2cccc(Cl)c2C1=O
Show InChI InChI=1S/C19H12ClN3O4/c1-10-7-8-27-16(10)17(24)22-11-5-6-14(21-9-11)23-18(25)12-3-2-4-13(20)15(12)19(23)26/h2-9H,1H3,(H,22,24)
n/an/an/an/a 1.11E+3n/an/an/an/a
Vanderbilt University Medical Center
Curated by ChEMBL
Assay Description
Positive allosteric modulation of human mGluR4 by calcium mobilization assay
Bioorg Med Chem Lett 25: 5107-10 (2015)
BindingDB Entry DOI: 10.7270/Q20C4XKQ
Metabotropic glutamate receptor 1
(Homo sapiens (Human))
BDBM50132807
(CHEMBL3634435)
Show SMILES Cc1ccoc1C(=O)Nc1ccc(nc1)N1C(=O)c2cccc(Cl)c2C1=O
Show InChI InChI=1S/C19H12ClN3O4/c1-10-7-8-27-16(10)17(24)22-11-5-6-14(21-9-11)23-18(25)12-3-2-4-13(20)15(12)19(23)26/h2-9H,1H3,(H,22,24)
n/an/a 35n/an/an/an/an/an/a
Vanderbilt University Medical Center
Curated by ChEMBL
Assay Description
Positive allosteric modulation of human mGluR1 by calcium mobilization assay
Bioorg Med Chem Lett 25: 5107-10 (2015)
BindingDB Entry DOI: 10.7270/Q20C4XKQ