BDBM50132839 CHEMBL3634561
SMILES: FC(F)(F)c1cc(Oc2ccc(CCOc3nc(=O)c(Cc4cncnc4)c[nH]3)cc2)ccc1Cl
InChI Key: InChIKey=DRACNSAQZFZUKW-UHFFFAOYSA-N
Data: 1 IC50
Activity Spreadsheet -- Enzyme Inhibition Constant Data from BindingDB
Found 1 hit for monomerid = 50132839
Trg + Lig
Ki
nM
ΔG°
kcal/mole
IC50
nM
Kd
nM
EC50/IC50
nM
koff
s-1
kon
M-1s-1
pHTemp
°C
LDL-associated phospholipase A2
(Homo sapiens (Human))
BDBM50132839
(CHEMBL3634561)
Show SMILES FC(F)(F)c1cc(Oc2ccc(CCOc3nc(=O)c(Cc4cncnc4)c[nH]3)cc2)ccc1Cl
Show InChI InChI=1S/C24H18ClF3N4O3/c25-21-6-5-19(10-20(21)24(26,27)28)35-18-3-1-15(2-4-18)7-8-34-23-31-13-17(22(33)32-23)9-16-11-29-14-30-12-16/h1-6,10-14H,7-9H2,(H,31,32,33)
NCI pathway
Reactome pathway
n/an/a 3.40n/an/an/an/an/an/a
Chinese Academy of Sciences
Curated by ChEMBL
Assay Description
Inhibition of recombinant human Lp-PLA2 using 2-thio-PAF substrate after 10 mins
J Med Chem 58: 8529-41 (2015)
BindingDB Entry DOI: 10.7270/Q2VQ34H4