BDBM50132892 Butyl-[3-(2,4-dichloro-phenyl)-1,5-dimethyl-1H-pyrazolo[4,3-b]pyridin-7-yl]-ethyl-amine::CHEMBL111665
SMILES: CCCCN(CC)c1cc(C)nc2c(nn(C)c12)-c1ccc(Cl)cc1Cl
InChI Key: InChIKey=ZFHZGWQWYGSYFW-UHFFFAOYSA-N
Data: 2 KI  2 IC50
Activity Spreadsheet -- Enzyme Inhibition Constant Data from BindingDB
Found 4 hits for monomerid = 50132892
Trg + Lig
Ki
nM
ΔG°
kcal/mole
IC50
nM
Kd
nM
EC50/IC50
nM
koff
s-1
kon
M-1s-1
pHTemp
°C
Corticotropin releasing factor receptor 1
(Homo sapiens (Human))
BDBM50132892
(Butyl-[3-(2,4-dichloro-phenyl)-1,5-dimethyl-1H-pyr...)
Show SMILES CCCCN(CC)c1cc(C)nc2c(nn(C)c12)-c1ccc(Cl)cc1Cl
Show InChI InChI=1S/C20H24Cl2N4/c1-5-7-10-26(6-2)17-11-13(3)23-19-18(24-25(4)20(17)19)15-9-8-14(21)12-16(15)22/h8-9,11-12H,5-7,10H2,1-4H3
Reactome pathway
2n/an/an/an/an/an/an/an/a
Neurocrine Biosciences, Inc.
Curated by ChEMBL
Assay Description
Binding affinity to the human corticotropin releasing factor receptor 1 expressed in HEK273 cells
Bioorg Med Chem Lett 13: 3367-70 (2003)
BindingDB Entry DOI: 10.7270/Q2542N05
Corticotropin releasing factor receptor 1
(Homo sapiens (Human))
BDBM50132892
(Butyl-[3-(2,4-dichloro-phenyl)-1,5-dimethyl-1H-pyr...)
Show SMILES CCCCN(CC)c1cc(C)nc2c(nn(C)c12)-c1ccc(Cl)cc1Cl
Show InChI InChI=1S/C20H24Cl2N4/c1-5-7-10-26(6-2)17-11-13(3)23-19-18(24-25(4)20(17)19)15-9-8-14(21)12-16(15)22/h8-9,11-12H,5-7,10H2,1-4H3
Reactome pathway
2n/an/an/an/an/an/an/an/a
Neurocrine Biosciences, Inc.
Curated by ChEMBL
Assay Description
Binding affinity towards Corticotropin releasing factor receptor 1 was measured through displacement of [125I]-sauvagine expressed in HEK293 cells
Bioorg Med Chem Lett 13: 3371-4 (2003)
BindingDB Entry DOI: 10.7270/Q21C1W8F
Corticotropin releasing factor receptor 1
(Homo sapiens (Human))
BDBM50132892
(Butyl-[3-(2,4-dichloro-phenyl)-1,5-dimethyl-1H-pyr...)
Show SMILES CCCCN(CC)c1cc(C)nc2c(nn(C)c12)-c1ccc(Cl)cc1Cl
Show InChI InChI=1S/C20H24Cl2N4/c1-5-7-10-26(6-2)17-11-13(3)23-19-18(24-25(4)20(17)19)15-9-8-14(21)12-16(15)22/h8-9,11-12H,5-7,10H2,1-4H3
Reactome pathway
n/an/a 16n/an/an/an/an/an/a
Neurocrine Biosciences, Inc.
Curated by ChEMBL
Assay Description
Compound was tested to inhibit Corticotropin releasing factor receptor 1-stimulated c-AMP production
Bioorg Med Chem Lett 13: 3367-70 (2003)
BindingDB Entry DOI: 10.7270/Q2542N05
Corticotropin releasing factor receptor 1
(Homo sapiens (Human))
BDBM50132892
(Butyl-[3-(2,4-dichloro-phenyl)-1,5-dimethyl-1H-pyr...)
Show SMILES CCCCN(CC)c1cc(C)nc2c(nn(C)c12)-c1ccc(Cl)cc1Cl
Show InChI InChI=1S/C20H24Cl2N4/c1-5-7-10-26(6-2)17-11-13(3)23-19-18(24-25(4)20(17)19)15-9-8-14(21)12-16(15)22/h8-9,11-12H,5-7,10H2,1-4H3
Reactome pathway
n/an/a 16n/an/an/an/an/an/a
Neurocrine Biosciences, Inc.
Curated by ChEMBL
Assay Description
Inhibition of Corticotropin releasing factor receptor 1-stimulated cAMP production
Bioorg Med Chem Lett 13: 3371-4 (2003)
BindingDB Entry DOI: 10.7270/Q21C1W8F