BDBM50132916 CHEMBL117209::[3-(2,4-Dichloro-phenyl)-1,5-dimethyl-1H-pyrazolo[4,3-b]pyridin-7-yl]-(2-methoxy-ethyl)-propyl-amine
SMILES: CCCN(CCOC)c1cc(C)nc2c(nn(C)c12)-c1ccc(Cl)cc1Cl
InChI Key: InChIKey=IDMWYSAMRPSJBP-UHFFFAOYSA-N
Data: 1 KI  1 IC50
Activity Spreadsheet -- Enzyme Inhibition Constant Data from BindingDB
Found 2 hits for monomerid = 50132916
Trg + Lig
Ki
nM
ΔG°
kcal/mole
IC50
nM
Kd
nM
EC50/IC50
nM
koff
s-1
kon
M-1s-1
pHTemp
°C
Corticotropin releasing factor receptor 1
(Homo sapiens (Human))
BDBM50132916
(CHEMBL117209 | [3-(2,4-Dichloro-phenyl)-1,5-dimeth...)
Show SMILES CCCN(CCOC)c1cc(C)nc2c(nn(C)c12)-c1ccc(Cl)cc1Cl
Show InChI InChI=1S/C20H24Cl2N4O/c1-5-8-26(9-10-27-4)17-11-13(2)23-19-18(24-25(3)20(17)19)15-7-6-14(21)12-16(15)22/h6-7,11-12H,5,8-10H2,1-4H3
Reactome pathway
5.10n/an/an/an/an/an/an/an/a
Neurocrine Biosciences, Inc.
Curated by ChEMBL
Assay Description
Binding affinity towards Corticotropin releasing factor receptor 1 was measured through displacement of [125I]-sauvagine expressed in HEK293 cells
Bioorg Med Chem Lett 13: 3371-4 (2003)
BindingDB Entry DOI: 10.7270/Q21C1W8F
Corticotropin releasing factor receptor 1
(Homo sapiens (Human))
BDBM50132916
(CHEMBL117209 | [3-(2,4-Dichloro-phenyl)-1,5-dimeth...)
Show SMILES CCCN(CCOC)c1cc(C)nc2c(nn(C)c12)-c1ccc(Cl)cc1Cl
Show InChI InChI=1S/C20H24Cl2N4O/c1-5-8-26(9-10-27-4)17-11-13(2)23-19-18(24-25(3)20(17)19)15-7-6-14(21)12-16(15)22/h6-7,11-12H,5,8-10H2,1-4H3
Reactome pathway
n/an/a 36n/an/an/an/an/an/a
Neurocrine Biosciences, Inc.
Curated by ChEMBL
Assay Description
Inhibition of Corticotropin releasing factor receptor 1-stimulated cAMP production
Bioorg Med Chem Lett 13: 3371-4 (2003)
BindingDB Entry DOI: 10.7270/Q21C1W8F