BDBM50133150 9-Fluoro-2,2,4-trimethyl-5-[1-pyridin-4-yl-meth-(Z)-ylidene]-2,5-dihydro-1H-6-oxa-1-aza-chrysene::CHEMBL336751
SMILES: CC1=CC(C)(C)Nc2ccc3-c4cc(F)ccc4O\C(=C/c4ccncc4)c3c12
InChI Key: InChIKey=JXKBRVHDTSWUJM-UUYOSTAYSA-N
Data: 1 KI  2 EC50
Activity Spreadsheet -- Enzyme Inhibition Constant Data from BindingDB
Found 3 hits for monomerid = 50133150
Trg + Lig
Ki
nM
ΔG°
kcal/mole
IC50
nM
Kd
nM
EC50/IC50
nM
koff
s-1
kon
M-1s-1
pHTemp
°C
Progesterone receptor
(Homo sapiens (Human))
BDBM50133150
(9-Fluoro-2,2,4-trimethyl-5-[1-pyridin-4-yl-meth-(Z...)
Show SMILES CC1=CC(C)(C)Nc2ccc3-c4cc(F)ccc4O\C(=C/c4ccncc4)c3c12 |t:1|
Show InChI InChI=1S/C25H21FN2O/c1-15-14-25(2,3)28-20-6-5-18-19-13-17(26)4-7-21(19)29-22(24(18)23(15)20)12-16-8-10-27-11-9-16/h4-14,28H,1-3H3/b22-12-
1.5n/an/an/an/an/an/an/an/a
Ligand Pharmaceuticals Inc.
Curated by ChEMBL
Assay Description
Binding affinity towards human progesterone receptor A isoform using progesterone as radioligand
J Med Chem 46: 4104-12 (2003)
Article DOI: 10.1021/jm020477g
BindingDB Entry DOI: 10.7270/Q2QZ29C6
Progesterone receptor
(Homo sapiens (Human))
BDBM50133150
(9-Fluoro-2,2,4-trimethyl-5-[1-pyridin-4-yl-meth-(Z...)
Show SMILES CC1=CC(C)(C)Nc2ccc3-c4cc(F)ccc4O\C(=C/c4ccncc4)c3c12 |t:1|
Show InChI InChI=1S/C25H21FN2O/c1-15-14-25(2,3)28-20-6-5-18-19-13-17(26)4-7-21(19)29-22(24(18)23(15)20)12-16-8-10-27-11-9-16/h4-14,28H,1-3H3/b22-12-
n/an/an/an/a 4.90n/an/an/an/a
Ligand Pharmaceuticals Inc.
Curated by ChEMBL
Assay Description
Agonistic activity against human progesterone receptor in T47D breast cancer cells
J Med Chem 46: 4104-12 (2003)
Article DOI: 10.1021/jm020477g
BindingDB Entry DOI: 10.7270/Q2QZ29C6
Progesterone receptor
(Homo sapiens (Human))
BDBM50133150
(9-Fluoro-2,2,4-trimethyl-5-[1-pyridin-4-yl-meth-(Z...)
Show SMILES CC1=CC(C)(C)Nc2ccc3-c4cc(F)ccc4O\C(=C/c4ccncc4)c3c12 |t:1|
Show InChI InChI=1S/C25H21FN2O/c1-15-14-25(2,3)28-20-6-5-18-19-13-17(26)4-7-21(19)29-22(24(18)23(15)20)12-16-8-10-27-11-9-16/h4-14,28H,1-3H3/b22-12-
n/an/an/an/a 5.80n/an/an/an/a
Ligand Pharmaceuticals Inc.
Curated by ChEMBL
Assay Description
Agonistic activity against human progesterone receptor in CV-1 cells
J Med Chem 46: 4104-12 (2003)
Article DOI: 10.1021/jm020477g
BindingDB Entry DOI: 10.7270/Q2QZ29C6