BDBM50133184 6-Dipropylamino-3,4,5,6,7,8-hexahydro-2H-naphthalen-1-one oxime::CHEMBL132575
SMILES: CCCN(CCC)C1CCC2=C(CCCC2C1)N=O
InChI Key: InChIKey=SZWSFWTZDMZIJS-UHFFFAOYSA-N
Data: 1 KI  1 EC50
Activity Spreadsheet -- Enzyme Inhibition Constant Data from BindingDB
Found 2 hits for monomerid = 50133184
Trg + Lig
Ki
nM
ΔG°
kcal/mole
IC50
nM
Kd
nM
EC50/IC50
nM
koff
s-1
kon
M-1s-1
pHTemp
°C
D(2) dopamine receptor
(Rattus norvegicus (rat))
BDBM50133184
(6-Dipropylamino-3,4,5,6,7,8-hexahydro-2H-naphthale...)
Show SMILES CCCN(CCC)C1CCC2=C(CCCC2C1)N=O |t:10|
Show InChI InChI=1S/C16H28N2O/c1-3-10-18(11-4-2)14-8-9-15-13(12-14)6-5-7-16(15)17-19/h13-14H,3-12H2,1-2H3
Reactome pathway
2.23E+3n/an/an/an/an/an/an/an/a
University Center for Pharmacy
Curated by ChEMBL
Assay Description
In vitro binding affinity of the compound towards Dopamine receptor D2
J Med Chem 46: 4136-40 (2003)
Article DOI: 10.1021/jm0307786
BindingDB Entry DOI: 10.7270/Q2M61JP7
D(2) dopamine receptor
(Homo sapiens (Human))
BDBM50133184
(6-Dipropylamino-3,4,5,6,7,8-hexahydro-2H-naphthale...)
Show SMILES CCCN(CCC)C1CCC2=C(CCCC2C1)N=O |t:10|
Show InChI InChI=1S/C16H28N2O/c1-3-10-18(11-4-2)14-8-9-15-13(12-14)6-5-7-16(15)17-19/h13-14H,3-12H2,1-2H3
Reactome pathway
n/an/an/an/a 170n/an/an/an/a
University Center for Pharmacy
Curated by ChEMBL
Assay Description
Tested for intrinsic activity of the compound towards Dopamine receptor D2 in CHO cells
J Med Chem 46: 4136-40 (2003)
Article DOI: 10.1021/jm0307786
BindingDB Entry DOI: 10.7270/Q2M61JP7