BDBM50133422 CHEMBL332472::Phosphoric acid mono-((R)-2-amino-2-tetradecylcarbamoyl-ethyl) ester; TFA
SMILES: CCCCCCCCCCCCCCNC(=O)[C@H](N)COP(O)(O)=O
InChI Key: InChIKey=MBCYDVXEMDWKEJ-MRXNPFEDSA-N
Data: 4 EC50
Activity Spreadsheet -- Enzyme Inhibition Constant Data from BindingDB
Found 4 hits for monomerid = 50133422
Trg + Lig
Ki
nM
ΔG°
kcal/mole
IC50
nM
Kd
nM
EC50/IC50
nM
koff
s-1
kon
M-1s-1
pHTemp
°C
Sphingosine 1-phosphate receptor 3
(Homo sapiens (Human))
BDBM50133422
(CHEMBL332472 | Phosphoric acid mono-((R)-2-amino-2...)
Show SMILES CCCCCCCCCCCCCCNC(=O)[C@H](N)COP(O)(O)=O
Show InChI InChI=1S/C17H37N2O5P/c1-2-3-4-5-6-7-8-9-10-11-12-13-14-19-17(20)16(18)15-24-25(21,22)23/h16H,2-15,18H2,1H3,(H,19,20)(H2,21,22,23)/t16-/m1/s1
NCI pathway
Reactome pathway
n/an/an/an/a 50.8n/an/an/an/a
University of Virginia
Curated by ChEMBL
Assay Description
In vitro binding affinity towards human Sphingosine 1-phosphate receptor 3 expressed in HEK293T cells using [gamma-35S]-GTP as radioligand
Bioorg Med Chem Lett 13: 3401-4 (2003)
BindingDB Entry DOI: 10.7270/Q29S1RMW
Sphingosine 1-phosphate receptor 1
(Homo sapiens (Human))
BDBM50133422
(CHEMBL332472 | Phosphoric acid mono-((R)-2-amino-2...)
Show SMILES CCCCCCCCCCCCCCNC(=O)[C@H](N)COP(O)(O)=O
Show InChI InChI=1S/C17H37N2O5P/c1-2-3-4-5-6-7-8-9-10-11-12-13-14-19-17(20)16(18)15-24-25(21,22)23/h16H,2-15,18H2,1H3,(H,19,20)(H2,21,22,23)/t16-/m1/s1
Reactome pathway
n/an/an/an/a 12.7n/an/an/an/a
University of Virginia
Curated by ChEMBL
Assay Description
In vitro binding affinity towards human Sphingosine 1-phosphate receptor 1 expressed in HEK293T cells using [gamma-35S]-GTP as radioligand
Bioorg Med Chem Lett 13: 3401-4 (2003)
BindingDB Entry DOI: 10.7270/Q29S1RMW
Sphingosine 1-phosphate receptor 2
(Homo sapiens (Human))
BDBM50133422
(CHEMBL332472 | Phosphoric acid mono-((R)-2-amino-2...)
Show SMILES CCCCCCCCCCCCCCNC(=O)[C@H](N)COP(O)(O)=O
Show InChI InChI=1S/C17H37N2O5P/c1-2-3-4-5-6-7-8-9-10-11-12-13-14-19-17(20)16(18)15-24-25(21,22)23/h16H,2-15,18H2,1H3,(H,19,20)(H2,21,22,23)/t16-/m1/s1
NCI pathway
Reactome pathway
n/an/an/an/a 2.11E+3n/an/an/an/a
University of Virginia
Curated by ChEMBL
Assay Description
In vitro binding affinity towards human Sphingosine 1-phosphate receptor 2 expressed in HEK293T cells using [gamma-35S]-GTP as radioligand
Bioorg Med Chem Lett 13: 3401-4 (2003)
BindingDB Entry DOI: 10.7270/Q29S1RMW
Sphingosine 1-phosphate receptor 5
(Homo sapiens (Human))
BDBM50133422
(CHEMBL332472 | Phosphoric acid mono-((R)-2-amino-2...)
Show SMILES CCCCCCCCCCCCCCNC(=O)[C@H](N)COP(O)(O)=O
Show InChI InChI=1S/C17H37N2O5P/c1-2-3-4-5-6-7-8-9-10-11-12-13-14-19-17(20)16(18)15-24-25(21,22)23/h16H,2-15,18H2,1H3,(H,19,20)(H2,21,22,23)/t16-/m1/s1
NCI pathway
Reactome pathway
n/an/an/an/a>5.00E+3n/an/an/an/a
University of Virginia
Curated by ChEMBL
Assay Description
In vitro binding affinity towards human Sphingosine 1-phosphate receptor 5 expressed in HEK293T cells using [gamma-35S]-GTP as radioligand
Bioorg Med Chem Lett 13: 3401-4 (2003)
BindingDB Entry DOI: 10.7270/Q29S1RMW