BDBM50133430 1-Benzyl-4-(2-chloro-phenyl)-6-methyl-1,4-dihydro-pyridine-2,3,5-tricarboxylic acid 5-isopropyl ester::CHEMBL114731
SMILES: CC(C)OC(=O)C1=C(C)N(Cc2ccccc2)C(C(O)=O)=C(C1c1ccccc1Cl)C(O)=O
InChI Key: InChIKey=QTZRBAHJKMPGBS-UHFFFAOYSA-N
Data: 2 IC50
Activity Spreadsheet -- Enzyme Inhibition Constant Data from BindingDB
Found 2 hits for monomerid = 50133430
Trg + Lig
Ki
nM
ΔG°
kcal/mole
IC50
nM
Kd
nM
EC50/IC50
nM
koff
s-1
kon
M-1s-1
pHTemp
°C
Muscle glycogen phosphorylase
(Homo sapiens (Human))
BDBM50133430
(1-Benzyl-4-(2-chloro-phenyl)-6-methyl-1,4-dihydro-...)
Show SMILES CC(C)OC(=O)C1=C(C)N(Cc2ccccc2)C(C(O)=O)=C(C1c1ccccc1Cl)C(O)=O |c:6,21|
Show InChI InChI=1S/C25H24ClNO6/c1-14(2)33-25(32)19-15(3)27(13-16-9-5-4-6-10-16)22(24(30)31)21(23(28)29)20(19)17-11-7-8-12-18(17)26/h4-12,14,20H,13H2,1-3H3,(H,28,29)(H,30,31)
Reactome pathway
n/an/a 26n/an/an/an/an/an/a
Merck Research Laboratories
Curated by ChEMBL
Assay Description
In vitro inhibitory activity against human muscle glycogen phosphorylase a (HMGPa)
Bioorg Med Chem Lett 13: 3405-8 (2003)
BindingDB Entry DOI: 10.7270/Q2TQ60XP
Glycogen Phosphorylase (PYGL)
(Homo sapiens (Human))
BDBM50133430
(1-Benzyl-4-(2-chloro-phenyl)-6-methyl-1,4-dihydro-...)
Show SMILES CC(C)OC(=O)C1=C(C)N(Cc2ccccc2)C(C(O)=O)=C(C1c1ccccc1Cl)C(O)=O |c:6,21|
Show InChI InChI=1S/C25H24ClNO6/c1-14(2)33-25(32)19-15(3)27(13-16-9-5-4-6-10-16)22(24(30)31)21(23(28)29)20(19)17-11-7-8-12-18(17)26/h4-12,14,20H,13H2,1-3H3,(H,28,29)(H,30,31)
Reactome pathway
n/an/a 11n/an/an/an/an/an/a
Merck Research Laboratories
Curated by ChEMBL
Assay Description
In vitro inhibitory activity against human liver glycogen phosphorylase a (HLGPa)
Bioorg Med Chem Lett 13: 3405-8 (2003)
BindingDB Entry DOI: 10.7270/Q2TQ60XP