BDBM50133434 4-(2-Chloro-phenyl)-1-(2,5-dichloro-benzyl)-6-methyl-1,4-dihydro-pyridine-2,3,5-tricarboxylic acid 5-isopropyl ester::CHEMBL117483
SMILES: CC(C)OC(=O)C1=C(C)N(Cc2cc(Cl)ccc2Cl)C(C(O)=O)=C(C1c1ccccc1Cl)C(O)=O
InChI Key: InChIKey=ICLXREKUBFYGQA-UHFFFAOYSA-N
Data: 2 IC50
Activity Spreadsheet -- Enzyme Inhibition Constant Data from BindingDB
Found 2 hits for monomerid = 50133434
Trg + Lig
Ki
nM
ΔG°
kcal/mole
IC50
nM
Kd
nM
EC50/IC50
nM
koff
s-1
kon
M-1s-1
pHTemp
°C
Muscle glycogen phosphorylase
(Homo sapiens (Human))
BDBM50133434
(4-(2-Chloro-phenyl)-1-(2,5-dichloro-benzyl)-6-meth...)
Show SMILES CC(C)OC(=O)C1=C(C)N(Cc2cc(Cl)ccc2Cl)C(C(O)=O)=C(C1c1ccccc1Cl)C(O)=O |c:6,23|
Show InChI InChI=1S/C25H22Cl3NO6/c1-12(2)35-25(34)19-13(3)29(11-14-10-15(26)8-9-17(14)27)22(24(32)33)21(23(30)31)20(19)16-6-4-5-7-18(16)28/h4-10,12,20H,11H2,1-3H3,(H,30,31)(H,32,33)
Reactome pathway
n/an/a 91n/an/an/an/an/an/a
Merck Research Laboratories
Curated by ChEMBL
Assay Description
In vitro inhibitory activity against human muscle glycogen phosphorylase a (HMGPa)
Bioorg Med Chem Lett 13: 3405-8 (2003)
BindingDB Entry DOI: 10.7270/Q2TQ60XP
Glycogen Phosphorylase (PYGL)
(Homo sapiens (Human))
BDBM50133434
(4-(2-Chloro-phenyl)-1-(2,5-dichloro-benzyl)-6-meth...)
Show SMILES CC(C)OC(=O)C1=C(C)N(Cc2cc(Cl)ccc2Cl)C(C(O)=O)=C(C1c1ccccc1Cl)C(O)=O |c:6,23|
Show InChI InChI=1S/C25H22Cl3NO6/c1-12(2)35-25(34)19-13(3)29(11-14-10-15(26)8-9-17(14)27)22(24(32)33)21(23(30)31)20(19)16-6-4-5-7-18(16)28/h4-10,12,20H,11H2,1-3H3,(H,30,31)(H,32,33)
Reactome pathway
n/an/a 65n/an/an/an/an/an/a
Merck Research Laboratories
Curated by ChEMBL
Assay Description
In vitro inhibitory activity against human liver glycogen phosphorylase a (HLGPa)
Bioorg Med Chem Lett 13: 3405-8 (2003)
BindingDB Entry DOI: 10.7270/Q2TQ60XP