BDBM50133475 CHEMBL3633031
SMILES: OC(=O)[C@@H](CC(=O)N1CCCCCCC1)NC(=O)c1csc(n1)-c1ccccc1
InChI Key: InChIKey=MSCYRXZPLIBMQR-MRXNPFEDSA-N
Data: 1 IC50
Activity Spreadsheet -- Enzyme Inhibition Constant Data from BindingDB
Found 1 hit for monomerid = 50133475
Trg + Lig
Ki
nM
ΔG°
kcal/mole
IC50
nM
Kd
nM
EC50/IC50
nM
koff
s-1
kon
M-1s-1
pHTemp
°C
Peptidyl-prolyl cis-trans isomerase NIMA-interacting 1
(Homo sapiens (Human))
BDBM50133475
(CHEMBL3633031)
Show SMILES OC(=O)[C@@H](CC(=O)N1CCCCCCC1)NC(=O)c1csc(n1)-c1ccccc1 |r|
Show InChI InChI=1S/C21H25N3O4S/c25-18(24-11-7-2-1-3-8-12-24)13-16(21(27)28)22-19(26)17-14-29-20(23-17)15-9-5-4-6-10-15/h4-6,9-10,14,16H,1-3,7-8,11-13H2,(H,22,26)(H,27,28)/t16-/m1/s1
NCI pathway
Reactome pathway
n/an/a 3.00E+3n/an/an/an/an/an/a
Nagoya City University
Curated by ChEMBL
Assay Description
Inhibition of Pin-1 (unknown origin) using suc-Ala-Glu-Pro-Phe-pNA as substrate preincubated for 10 mins followed by substrate addition measured afte...
Bioorg Med Chem Lett 25: 5619-24 (2015)
BindingDB Entry DOI: 10.7270/Q25X2BSP