BDBM50133683 CHEMBL3633657
SMILES: CN(CC(=O)N1CCOCC1)CC(=O)c1c([nH]c2ccccc12)-c1ccco1
InChI Key: InChIKey=ZXRVOLIRSFHFJD-UHFFFAOYSA-N
Data: 2 IC50
Activity Spreadsheet -- Enzyme Inhibition Constant Data from BindingDB
Found 2 hits for monomerid = 50133683
Trg + Lig
Ki
nM
ΔG°
kcal/mole
IC50
nM
Kd
nM
EC50/IC50
nM
koff
s-1
kon
M-1s-1
pHTemp
°C
G-protein coupled receptor family C group 6 member A
(Mus musculus)
BDBM50133683
(CHEMBL3633657)
Show SMILES CN(CC(=O)N1CCOCC1)CC(=O)c1c([nH]c2ccccc12)-c1ccco1
Show InChI InChI=1S/C21H23N3O4/c1-23(14-19(26)24-8-11-27-12-9-24)13-17(25)20-15-5-2-3-6-16(15)22-21(20)18-7-4-10-28-18/h2-7,10,22H,8-9,11-14H2,1H3
n/an/a 2.48E+5n/an/an/an/an/an/a
University of Copenhagen
Curated by ChEMBL
Assay Description
Antagonist activity at mouse GPRC6A receptor expressed in HEK293 cells assessed as inhibition of L-ornithine-induced inositol monophosphate accumulat...
J Med Chem 58: 8938-51 (2015)
BindingDB Entry DOI: 10.7270/Q2DF6T1G
G-protein coupled receptor family C group 6 member A
(Mus musculus)
BDBM50133683
(CHEMBL3633657)
Show SMILES CN(CC(=O)N1CCOCC1)CC(=O)c1c([nH]c2ccccc12)-c1ccco1
Show InChI InChI=1S/C21H23N3O4/c1-23(14-19(26)24-8-11-27-12-9-24)13-17(25)20-15-5-2-3-6-16(15)22-21(20)18-7-4-10-28-18/h2-7,10,22H,8-9,11-14H2,1H3
n/an/a 2.45E+5n/an/an/an/an/an/a
University of Copenhagen
Curated by ChEMBL
Assay Description
Antagonist activity at mouse GPRC6A receptor expressed in HEK293 cells assessed as inhibition of L-ornithine-induced inositol monophosphate accumulat...
J Med Chem 58: 8938-51 (2015)
BindingDB Entry DOI: 10.7270/Q2DF6T1G