null
SMILES: C[C@H]1[C@@H]2[C@H](CCN2C(=O)[C@@H]2CCCN2C(=O)c2sc3ccc(Cl)cc3c2C)N(C(=O)C2CC2)C1=O
InChI Key: InChIKey=JRQWCOUDMNNTQH-CMBBURJTSA-N
Activity Spreadsheet -- Enzyme Inhibition Constant Data from BindingDB
Found 2 hits for monomerid = 50133962
Trg + Lig
Ki
nM
ΔG°
kcal/mole
IC50
nM
Kd
nM
EC50/IC50
nM
koff
s-1
kon
M-1s-1
pHTemp
°C
Capsid scaffolding protein
(Human cytomegalovirus (strain AD169) (HHV-5) (Huma...)
BDBM50133962
((3S,3aR,6aS)-4-({(2S)-1-[(5-Chloro-3-methyl-1-benz...)
Show SMILES C[C@H]1[C@@H]2[C@H](CCN2C(=O)[C@@H]2CCCN2C(=O)c2sc3ccc(Cl)cc3c2C)N(C(=O)C2CC2)C1=O |r|
Show InChI InChI=1S/C26H28ClN3O4S/c1-13-17-12-16(27)7-8-20(17)35-22(13)26(34)28-10-3-4-19(28)25(33)29-11-9-18-21(29)14(2)23(31)30(18)24(32)15-5-6-15/h7-8,12,14-15,18-19,21H,3-6,9-11H2,1-2H3/t14-,18-,19-,21+/m0/s1
2n/an/an/an/an/an/an/an/a
GlaxoSmithKline Research and Development
Curated by ChEMBL
Assay Description
Potency against human cytomegalovirus protease in HCMV pNA assay
J Med Chem 46: 4428-49 (2003)
Article DOI: 10.1021/jm030810w
BindingDB Entry DOI: 10.7270/Q2WH2PD8
Capsid scaffolding protein
(Human cytomegalovirus (strain AD169) (HHV-5) (Huma...)
BDBM50133962
((3S,3aR,6aS)-4-({(2S)-1-[(5-Chloro-3-methyl-1-benz...)
Show SMILES C[C@H]1[C@@H]2[C@H](CCN2C(=O)[C@@H]2CCCN2C(=O)c2sc3ccc(Cl)cc3c2C)N(C(=O)C2CC2)C1=O |r|
Show InChI InChI=1S/C26H28ClN3O4S/c1-13-17-12-16(27)7-8-20(17)35-22(13)26(34)28-10-3-4-19(28)25(33)29-11-9-18-21(29)14(2)23(31)30(18)24(32)15-5-6-15/h7-8,12,14-15,18-19,21H,3-6,9-11H2,1-2H3/t14-,18-,19-,21+/m0/s1
n/an/a 190n/an/an/an/an/an/a
GlaxoSmithKline Research and Development
Curated by ChEMBL
Assay Description
Inhibition of human cytomegalovirus protease in HCMV pNA assay.
J Med Chem 46: 4428-49 (2003)
Article DOI: 10.1021/jm030810w
BindingDB Entry DOI: 10.7270/Q2WH2PD8