BDBM50133977 (2S)-2-{[(3aS,6S,6aR)-4-(Cyclopropylcarbonyl)-6-methyl-5-oxohexahydropyrrolo[3,2-b]pyrrol-1(2H)-yl]carbonyl}-N-(4-chlorophenyl)pyrrolidine-1-carboxamide::(S)-2-((3aS,6S,6aR)-4-Cyclopropanecarbonyl-6-methyl-5-oxo-hexahydro-pyrrolo[3,2-b]pyrrole-1-carbonyl)-pyrrolidine-1-carboxylic acid (4-chloro-phenyl)-amide::CHEMBL342014
SMILES: C[C@H]1[C@@H]2[C@H](CCN2C(=O)[C@@H]2CCCN2C(=O)Nc2ccc(Cl)cc2)N(C(=O)C2CC2)C1=O
InChI Key: InChIKey=CCILUKMNTFJNPQ-ZQEOTTOMSA-N
Data: 1 KI  1 IC50
Activity Spreadsheet -- Enzyme Inhibition Constant Data from BindingDB
Found 2 hits for monomerid = 50133977
Trg + Lig
Ki
nM
ΔG°
kcal/mole
IC50
nM
Kd
nM
EC50/IC50
nM
koff
s-1
kon
M-1s-1
pHTemp
°C
Human herpes virus 5 capsid protein P40
(Human cytomegalovirus (strain AD169) (HHV-5) (Huma...)
BDBM50133977
((2S)-2-{[(3aS,6S,6aR)-4-(Cyclopropylcarbonyl)-6-me...)
Show SMILES C[C@H]1[C@@H]2[C@H](CCN2C(=O)[C@@H]2CCCN2C(=O)Nc2ccc(Cl)cc2)N(C(=O)C2CC2)C1=O |r|
Show InChI InChI=1S/C23H27ClN4O4/c1-13-19-17(28(20(13)29)21(30)14-4-5-14)10-12-27(19)22(31)18-3-2-11-26(18)23(32)25-16-8-6-15(24)7-9-16/h6-9,13-14,17-19H,2-5,10-12H2,1H3,(H,25,32)/t13-,17-,18-,19+/m0/s1
38n/an/an/an/an/an/an/an/a
GlaxoSmithKline Research and Development
Curated by ChEMBL
Assay Description
Potency against human cytomegalovirus protease in HCMV pNA assay
J Med Chem 46: 4428-49 (2003)
Article DOI: 10.1021/jm030810w
BindingDB Entry DOI: 10.7270/Q2WH2PD8
Human herpes virus 5 capsid protein P40
(Human cytomegalovirus (strain AD169) (HHV-5) (Huma...)
BDBM50133977
((2S)-2-{[(3aS,6S,6aR)-4-(Cyclopropylcarbonyl)-6-me...)
Show SMILES C[C@H]1[C@@H]2[C@H](CCN2C(=O)[C@@H]2CCCN2C(=O)Nc2ccc(Cl)cc2)N(C(=O)C2CC2)C1=O |r|
Show InChI InChI=1S/C23H27ClN4O4/c1-13-19-17(28(20(13)29)21(30)14-4-5-14)10-12-27(19)22(31)18-3-2-11-26(18)23(32)25-16-8-6-15(24)7-9-16/h6-9,13-14,17-19H,2-5,10-12H2,1H3,(H,25,32)/t13-,17-,18-,19+/m0/s1
n/an/a 260n/an/an/an/an/an/a
GlaxoSmithKline Research and Development
Curated by ChEMBL
Assay Description
Inhibition of human cytomegalovirus protease in HCMV pNA assay.
J Med Chem 46: 4428-49 (2003)
Article DOI: 10.1021/jm030810w
BindingDB Entry DOI: 10.7270/Q2WH2PD8