null
SMILES: C[C@H]1[C@@H]2[C@H](CCN2C(=O)[C@@H]2CCCN2C(=O)c2ccc(cc2)-c2ccccc2)N(C(=O)C2CC2)C1=O
InChI Key: InChIKey=BLMRFTBYNMKUCA-PAWHMVCQSA-N
Activity Spreadsheet -- Enzyme Inhibition Constant Data from BindingDB
Found 2 hits for monomerid = 50133992
Trg + Lig
Ki
nM
ΔG°
kcal/mole
IC50
nM
Kd
nM
EC50/IC50
nM
koff
s-1
kon
M-1s-1
pHTemp
°C
Capsid scaffolding protein
(Human cytomegalovirus (strain AD169) (HHV-5) (Huma...)
BDBM50133992
((3S,3aR,6aS)-4-[(S)-1-(Biphenyl-4-carbonyl)-pyrrol...)
Show SMILES C[C@H]1[C@@H]2[C@H](CCN2C(=O)[C@@H]2CCCN2C(=O)c2ccc(cc2)-c2ccccc2)N(C(=O)C2CC2)C1=O
Show InChI InChI=1S/C29H31N3O4/c1-18-25-23(32(26(18)33)28(35)22-13-14-22)15-17-31(25)29(36)24-8-5-16-30(24)27(34)21-11-9-20(10-12-21)19-6-3-2-4-7-19/h2-4,6-7,9-12,18,22-25H,5,8,13-17H2,1H3/t18-,23-,24-,25+/m0/s1
n/an/a 300n/an/an/an/an/an/a
GlaxoSmithKline Research and Development
Curated by ChEMBL
Assay Description
Inhibition of human cytomegalovirus protease in HCMV pNA assay.
J Med Chem 46: 4428-49 (2003)
Article DOI: 10.1021/jm030810w
BindingDB Entry DOI: 10.7270/Q2WH2PD8
Capsid scaffolding protein
(Human cytomegalovirus (strain AD169) (HHV-5) (Huma...)
BDBM50133992
((3S,3aR,6aS)-4-[(S)-1-(Biphenyl-4-carbonyl)-pyrrol...)
Show SMILES C[C@H]1[C@@H]2[C@H](CCN2C(=O)[C@@H]2CCCN2C(=O)c2ccc(cc2)-c2ccccc2)N(C(=O)C2CC2)C1=O
Show InChI InChI=1S/C29H31N3O4/c1-18-25-23(32(26(18)33)28(35)22-13-14-22)15-17-31(25)29(36)24-8-5-16-30(24)27(34)21-11-9-20(10-12-21)19-6-3-2-4-7-19/h2-4,6-7,9-12,18,22-25H,5,8,13-17H2,1H3/t18-,23-,24-,25+/m0/s1
21n/an/an/an/an/an/an/an/a
GlaxoSmithKline Research and Development
Curated by ChEMBL
Assay Description
Potency against human cytomegalovirus protease in HCMV pNA assay
J Med Chem 46: 4428-49 (2003)
Article DOI: 10.1021/jm030810w
BindingDB Entry DOI: 10.7270/Q2WH2PD8