BDBM50134010 CHEMBL139511::N,N'-(9-(2-aminophenylamino)acridine-3,6-diyl)bis(3-(pyrrolidin-1-yl)propanamide)::N-[9-(2-Amino-phenylamino)-6-(3-pyrrolidin-1-yl-propionylamino)-acridin-3-yl]-3-pyrrolidin-1-yl-propionamide
SMILES: Nc1ccccc1Nc1c2ccc(NC(=O)CCN3CCCC3)cc2nc2cc(NC(=O)CCN3CCCC3)ccc12
InChI Key: InChIKey=NHRMPDKSXMUOQJ-UHFFFAOYSA-N
Data: 1 IC50  1 EC50
Activity Spreadsheet -- Enzyme Inhibition Constant Data from BindingDB
Found 2 hits for monomerid = 50134010
Trg + Lig
Ki
nM
ΔG°
kcal/mole
IC50
nM
Kd
nM
EC50/IC50
nM
koff
s-1
kon
M-1s-1
pHTemp
°C
Telomerase reverse transcriptase
(Homo sapiens (Human))
BDBM50134010
(CHEMBL139511 | N,N'-(9-(2-aminophenylamino)acridin...)
Show SMILES Nc1ccccc1Nc1c2ccc(NC(=O)CCN3CCCC3)cc2nc2cc(NC(=O)CCN3CCCC3)ccc12
Show InChI InChI=1S/C33H39N7O2/c34-27-7-1-2-8-28(27)38-33-25-11-9-23(35-31(41)13-19-39-15-3-4-16-39)21-29(25)37-30-22-24(10-12-26(30)33)36-32(42)14-20-40-17-5-6-18-40/h1-2,7-12,21-22H,3-6,13-20,34H2,(H,35,41)(H,36,42)(H,37,38)
NCI pathway
Reactome pathway
n/an/a 20n/an/an/an/an/an/a
Central University of Las Villas
Curated by ChEMBL
Assay Description
Inhibition of telomerase in human A2780 cells by TRAP assay
Eur J Med Chem 44: 4826-40 (2009)
Article DOI: 10.1016/j.ejmech.2009.07.029
BindingDB Entry DOI: 10.7270/Q20R9PHM
Telomerase reverse transcriptase
(Homo sapiens (Human))
BDBM50134010
(CHEMBL139511 | N,N'-(9-(2-aminophenylamino)acridin...)
Show SMILES Nc1ccccc1Nc1c2ccc(NC(=O)CCN3CCCC3)cc2nc2cc(NC(=O)CCN3CCCC3)ccc12
Show InChI InChI=1S/C33H39N7O2/c34-27-7-1-2-8-28(27)38-33-25-11-9-23(35-31(41)13-19-39-15-3-4-16-39)21-29(25)37-30-22-24(10-12-26(30)33)36-32(42)14-20-40-17-5-6-18-40/h1-2,7-12,21-22H,3-6,13-20,34H2,(H,35,41)(H,36,42)(H,37,38)
NCI pathway
Reactome pathway
n/an/an/an/a 20n/an/an/an/a
University of London
Curated by ChEMBL
Assay Description
Inhibitory activity against human telomerase
J Med Chem 46: 4463-76 (2003)
Article DOI: 10.1021/jm0308693
BindingDB Entry DOI: 10.7270/Q2RR1XN3