BDBM50134093 (3aR,10R)-2-Butyl-10-(4-methoxy-phenyl)-3a,4,9,10-tetrahydro-2,9,10a-triaza-cyclopenta[b]fluorene-1,3-dione::CHEMBL422104::Cis-2-Butyl-10-(4-methoxy-phenyl)-3a,4,9,10-tetrahydro-2,9,10a-triaza-cyclopenta[b]fluorene-1,3-dione
SMILES: CCCCn1c(O)c2Cc3c([nH]c4ccccc34)[C@@H](c3ccc(OC)cc3)n2c1=O
InChI Key: InChIKey=GKNMKFGNESPSPX-JOCHJYFZSA-N
Data: 4 IC50
Activity Spreadsheet -- Enzyme Inhibition Constant Data from BindingDB
Found 4 hits for monomerid = 50134093
Trg + Lig
Ki
nM
ΔG°
kcal/mole
IC50
nM
Kd
nM
EC50/IC50
nM
koff
s-1
kon
M-1s-1
pHTemp
°C
cGMP-specific 3',5'-cyclic phosphodiesterase
(Homo sapiens (Human))
BDBM50134093
((3aR,10R)-2-Butyl-10-(4-methoxy-phenyl)-3a,4,9,10-...)
Show SMILES CCCCn1c(O)c2Cc3c([nH]c4ccccc34)[C@@H](c3ccc(OC)cc3)n2c1=O |r|
Show InChI InChI=1S/C24H25N3O3/c1-3-4-13-26-23(28)20-14-18-17-7-5-6-8-19(17)25-21(18)22(27(20)24(26)29)15-9-11-16(30-2)12-10-15/h5-12,22,25,28H,3-4,13-14H2,1-2H3/t22-/m1/s1
Reactome pathway
n/an/a 7.90n/an/an/an/an/an/a
Universidade Federal de Lavras-UFLA
Curated by ChEMBL
Assay Description
Inhibition of PDE5
Bioorg Med Chem 16: 7599-606 (2008)
Article DOI: 10.1016/j.bmc.2008.07.022
BindingDB Entry DOI: 10.7270/Q2VX0HRR
Phosphodiesterase 5A
(Bos taurus)
BDBM50134093
((3aR,10R)-2-Butyl-10-(4-methoxy-phenyl)-3a,4,9,10-...)
Show SMILES CCCCn1c(O)c2Cc3c([nH]c4ccccc34)[C@@H](c3ccc(OC)cc3)n2c1=O |r|
Show InChI InChI=1S/C24H25N3O3/c1-3-4-13-26-23(28)20-14-18-17-7-5-6-8-19(17)25-21(18)22(27(20)24(26)29)15-9-11-16(30-2)12-10-15/h5-12,22,25,28H,3-4,13-14H2,1-2H3/t22-/m1/s1
Reactome pathway
n/an/a 8n/an/an/an/an/an/a
Centre de Recherches
Curated by ChEMBL
Assay Description
Inhibitory activity against bovine PDE5 (phosphodiesterase-5).
J Med Chem 46: 4525-32 (2003)
Article DOI: 10.1021/jm030056e
BindingDB Entry DOI: 10.7270/Q2NP255G
Homo sapiens phosphodiesterase 2A (PDE2A)
(Homo sapiens (Human))
BDBM50134093
((3aR,10R)-2-Butyl-10-(4-methoxy-phenyl)-3a,4,9,10-...)
Show SMILES CCCCn1c(O)c2Cc3c([nH]c4ccccc34)[C@@H](c3ccc(OC)cc3)n2c1=O |r|
Show InChI InChI=1S/C24H25N3O3/c1-3-4-13-26-23(28)20-14-18-17-7-5-6-8-19(17)25-21(18)22(27(20)24(26)29)15-9-11-16(30-2)12-10-15/h5-12,22,25,28H,3-4,13-14H2,1-2H3/t22-/m1/s1
n/an/a>1.00E+4n/an/an/an/an/an/a
Centre de Recherches
Curated by ChEMBL
Assay Description
Inhibition of human recombinant PDE2 (phosphodiesterase 2)
J Med Chem 46: 4525-32 (2003)
Article DOI: 10.1021/jm030056e
BindingDB Entry DOI: 10.7270/Q2NP255G
Heart phosphodiesterase
(Bos taurus)
BDBM50134093
((3aR,10R)-2-Butyl-10-(4-methoxy-phenyl)-3a,4,9,10-...)
Show SMILES CCCCn1c(O)c2Cc3c([nH]c4ccccc34)[C@@H](c3ccc(OC)cc3)n2c1=O |r|
Show InChI InChI=1S/C24H25N3O3/c1-3-4-13-26-23(28)20-14-18-17-7-5-6-8-19(17)25-21(18)22(27(20)24(26)29)15-9-11-16(30-2)12-10-15/h5-12,22,25,28H,3-4,13-14H2,1-2H3/t22-/m1/s1
n/an/a>1.00E+4n/an/an/an/an/an/a
Centre de Recherches
Curated by ChEMBL
Assay Description
Inhibition of bovine aorta PDE3 (phosphodiesterase 3)
J Med Chem 46: 4525-32 (2003)
Article DOI: 10.1021/jm030056e
BindingDB Entry DOI: 10.7270/Q2NP255G