BDBM50134104 (3aR,10S)-2-Butyl-10-(4-chloro-phenyl)-3a,4,9,10-tetrahydro-2,9,10a-triaza-cyclopenta[b]fluorene-1,3-dione::CHEMBL344630::Trans-2-Butyl-10-(4-chloro-phenyl)-3a,4,9,10-tetrahydro-2,9,10a-triaza-cyclopenta[b]fluorene-1,3-dione
SMILES: CCCCn1c(O)c2Cc3c([nH]c4ccccc34)[C@H](c3ccc(Cl)cc3)n2c1=O
InChI Key: InChIKey=LUWMLICOBBYOOA-NRFANRHFSA-N
Data: 2 IC50
Activity Spreadsheet -- Enzyme Inhibition Constant Data from BindingDB
Found 2 hits for monomerid = 50134104
Trg + Lig
Ki
nM
ΔG°
kcal/mole
IC50
nM
Kd
nM
EC50/IC50
nM
koff
s-1
kon
M-1s-1
pHTemp
°C
Phosphodiesterase 5A
(Bos taurus)
BDBM50134104
((3aR,10S)-2-Butyl-10-(4-chloro-phenyl)-3a,4,9,10-t...)
Show SMILES CCCCn1c(O)c2Cc3c([nH]c4ccccc34)[C@H](c3ccc(Cl)cc3)n2c1=O |r|
Show InChI InChI=1S/C23H22ClN3O2/c1-2-3-12-26-22(28)19-13-17-16-6-4-5-7-18(16)25-20(17)21(27(19)23(26)29)14-8-10-15(24)11-9-14/h4-11,21,25,28H,2-3,12-13H2,1H3/t21-/m0/s1
Reactome pathway
n/an/a 20n/an/an/an/an/an/a
Centre de Recherches
Curated by ChEMBL
Assay Description
Inhibitory activity against bovine PDE5 (phosphodiesterase-5).
J Med Chem 46: 4525-32 (2003)
Article DOI: 10.1021/jm030056e
BindingDB Entry DOI: 10.7270/Q2NP255G
cGMP-specific 3',5'-cyclic phosphodiesterase
(Homo sapiens (Human))
BDBM50134104
((3aR,10S)-2-Butyl-10-(4-chloro-phenyl)-3a,4,9,10-t...)
Show SMILES CCCCn1c(O)c2Cc3c([nH]c4ccccc34)[C@H](c3ccc(Cl)cc3)n2c1=O |r|
Show InChI InChI=1S/C23H22ClN3O2/c1-2-3-12-26-22(28)19-13-17-16-6-4-5-7-18(16)25-20(17)21(27(19)23(26)29)14-8-10-15(24)11-9-14/h4-11,21,25,28H,2-3,12-13H2,1H3/t21-/m0/s1
Reactome pathway
n/an/a 20n/an/an/an/an/an/a
Universidade Federal de Lavras-UFLA
Curated by ChEMBL
Assay Description
Inhibition of PDE5
Bioorg Med Chem 16: 7599-606 (2008)
Article DOI: 10.1016/j.bmc.2008.07.022
BindingDB Entry DOI: 10.7270/Q2VX0HRR