BDBM50134227 (E)-N-Hydroxy-3-[4-({[2-(1H-indol-3-yl)-ethyl]-isopropyl-amino}-methyl)-phenyl]-acrylamide::CHEMBL142992
SMILES: CC(C)N(CCc1c[nH]c2ccccc12)Cc1ccc(\C=C\C(=O)NO)cc1
InChI Key: InChIKey=ILAZEUQGANOTAY-VAWYXSNFSA-N
Data: 3 IC50
Activity Spreadsheet -- Enzyme Inhibition Constant Data from BindingDB
Found 3 hits for monomerid = 50134227
Trg + Lig
Ki
nM
ΔG°
kcal/mole
IC50
nM
Kd
nM
EC50/IC50
nM
koff
s-1
kon
M-1s-1
pHTemp
°C
Histone deacetylase 1
(Homo sapiens (Human))
BDBM50134227
((E)-N-Hydroxy-3-[4-({[2-(1H-indol-3-yl)-ethyl]-iso...)
Show SMILES CC(C)N(CCc1c[nH]c2ccccc12)Cc1ccc(\C=C\C(=O)NO)cc1
Show InChI InChI=1S/C23H27N3O2/c1-17(2)26(14-13-20-15-24-22-6-4-3-5-21(20)22)16-19-9-7-18(8-10-19)11-12-23(27)25-28/h3-12,15,17,24,28H,13-14,16H2,1-2H3,(H,25,27)/b12-11+
NCI pathway
Reactome pathway
n/an/a 23n/an/an/an/an/an/a
Novartis Institutes for Biomedical Research
Curated by ChEMBL
Assay Description
Inhibition of HDAC1
J Med Chem 54: 4752-72 (2011)
Article DOI: 10.1021/jm200388e
BindingDB Entry DOI: 10.7270/Q23N24DW
Histone deacetylase
(Homo sapiens (Human))
BDBM50134227
((E)-N-Hydroxy-3-[4-({[2-(1H-indol-3-yl)-ethyl]-iso...)
Show SMILES CC(C)N(CCc1c[nH]c2ccccc12)Cc1ccc(\C=C\C(=O)NO)cc1
Show InChI InChI=1S/C23H27N3O2/c1-17(2)26(14-13-20-15-24-22-6-4-3-5-21(20)22)16-19-9-7-18(8-10-19)11-12-23(27)25-28/h3-12,15,17,24,28H,13-14,16H2,1-2H3,(H,25,27)/b12-11+
n/an/a 23n/an/an/an/an/an/a
Novartis Institute for Biomedical Research
Curated by ChEMBL
Assay Description
Inhibitory activity against histone deacetylase (HDAC) enzyme obtained from H1299 human lung carcinoma cell lysates
J Med Chem 46: 4609-24 (2003)
Article DOI: 10.1021/jm030235w
BindingDB Entry DOI: 10.7270/Q2736TP0
Potassium voltage-gated channel subfamily H member 2
(Homo sapiens (Human))
BDBM50134227
((E)-N-Hydroxy-3-[4-({[2-(1H-indol-3-yl)-ethyl]-iso...)
Show SMILES CC(C)N(CCc1c[nH]c2ccccc12)Cc1ccc(\C=C\C(=O)NO)cc1
Show InChI InChI=1S/C23H27N3O2/c1-17(2)26(14-13-20-15-24-22-6-4-3-5-21(20)22)16-19-9-7-18(8-10-19)11-12-23(27)25-28/h3-12,15,17,24,28H,13-14,16H2,1-2H3,(H,25,27)/b12-11+
Reactome pathway
n/an/a 5.87E+3n/an/an/an/an/an/a
Novartis Institutes for Biomedical Research
Curated by ChEMBL
Assay Description
Inhibition of human ERG by radioligand binding assay
J Med Chem 54: 4752-72 (2011)
Article DOI: 10.1021/jm200388e
BindingDB Entry DOI: 10.7270/Q23N24DW