null
SMILES: OC(=O)C[C@H](N1CCN(CCCc2ccc3CCCNc3n2)C1=O)c1cccnc1
InChI Key: InChIKey=ODFWEQUMDQJBJZ-IBGZPJMESA-N
Activity Spreadsheet -- Enzyme Inhibition Constant Data from BindingDB
Found 1 hit for monomerid = 50134780
Trg + Lig
Ki
nM
ΔG°
kcal/mole
IC50
nM
Kd
nM
EC50/IC50
nM
koff
s-1
kon
M-1s-1
pHTemp
°C
Integrin alpha-V/beta-3
(Homo sapiens (Human))
BDBM50134780
((S)-3-{2-Oxo-3-[3-(5,6,7,8-tetrahydro-[1,8]naphthy...)
Show SMILES OC(=O)C[C@H](N1CCN(CCCc2ccc3CCCNc3n2)C1=O)c1cccnc1
Show InChI InChI=1S/C22H27N5O3/c28-20(29)14-19(17-5-1-9-23-15-17)27-13-12-26(22(27)30)11-3-6-18-8-7-16-4-2-10-24-21(16)25-18/h1,5,7-9,15,19H,2-4,6,10-14H2,(H,24,25)(H,28,29)/t19-/m0/s1
n/an/a 0.25n/an/an/an/an/an/a
Merck Research Laboratories
Curated by ChEMBL
Assay Description
Inhibition of alphaV-beta3 integrin binding
J Med Chem 46: 4790-8 (2003)
Article DOI: 10.1021/jm030306r
BindingDB Entry DOI: 10.7270/Q29K49N1