BDBM50134859 4-(6-Benzyloxy-7-methoxy-quinazolin-4-yl)-piperazine-1-carboxylic acid (4-cyano-phenyl)-amide::CHEMBL148047
SMILES: COc1cc2ncnc(N3CCN(CC3)C(=O)Nc3ccc(cc3)C#N)c2cc1OCc1ccccc1
InChI Key: InChIKey=IFAVFMRBYILKCW-UHFFFAOYSA-N
Data: 1 IC50
Activity Spreadsheet -- Enzyme Inhibition Constant Data from BindingDB
Found 1 hit for monomerid = 50134859
Trg + Lig
Ki
nM
ΔG°
kcal/mole
IC50
nM
Kd
nM
EC50/IC50
nM
koff
s-1
kon
M-1s-1
pHTemp
°C
Platelet-derived growth factor receptor beta
(Homo sapiens (Human))
BDBM50134859
(4-(6-Benzyloxy-7-methoxy-quinazolin-4-yl)-piperazi...)
Show SMILES COc1cc2ncnc(N3CCN(CC3)C(=O)Nc3ccc(cc3)C#N)c2cc1OCc1ccccc1
Show InChI InChI=1S/C28H26N6O3/c1-36-25-16-24-23(15-26(25)37-18-21-5-3-2-4-6-21)27(31-19-30-24)33-11-13-34(14-12-33)28(35)32-22-9-7-20(17-29)8-10-22/h2-10,15-16,19H,11-14,18H2,1H3,(H,32,35)
NCI pathway
Reactome pathway
n/an/a>3.00E+4n/an/an/an/an/an/a
Pharmaceutical Research Institute
Curated by ChEMBL
Assay Description
Inhibition of platelet-derived growth factor receptor beta phosphorylation was measured in intact cells using a two-site enzyme linked immunosorbent ...
J Med Chem 46: 4910-25 (2003)
Article DOI: 10.1021/jm020505v
BindingDB Entry DOI: 10.7270/Q2X929PJ