null
SMILES: COc1cc2ncnc(N3CCN(CC3)C(=O)Nc3ccc(Oc4ccccc4)cc3)c2cc1OS(C)(=O)=O
InChI Key: InChIKey=BFZTXYLOHPXTMG-UHFFFAOYSA-N
Activity Spreadsheet -- Enzyme Inhibition Constant Data from BindingDB
Found 1 hit for monomerid = 50134866
Trg + Lig
Ki
nM
ΔG°
kcal/mole
IC50
nM
Kd
nM
EC50/IC50
nM
koff
s-1
kon
M-1s-1
pHTemp
°C
Platelet-derived growth factor receptor beta
(Homo sapiens (Human))
BDBM50134866
(CHEMBL344091 | Methanesulfonic acid 7-methoxy-4-[4...)
Show SMILES COc1cc2ncnc(N3CCN(CC3)C(=O)Nc3ccc(Oc4ccccc4)cc3)c2cc1OS(C)(=O)=O
Show InChI InChI=1S/C27H27N5O6S/c1-36-24-17-23-22(16-25(24)38-39(2,34)35)26(29-18-28-23)31-12-14-32(15-13-31)27(33)30-19-8-10-21(11-9-19)37-20-6-4-3-5-7-20/h3-11,16-18H,12-15H2,1-2H3,(H,30,33)
NCI pathway
Reactome pathway
n/an/a 70n/an/an/an/an/an/a
Pharmaceutical Research Institute
Curated by ChEMBL
Assay Description
Inhibition of platelet-derived growth factor receptor beta phosphorylation was measured in intact cells using a two-site enzyme linked immunosorbent ...
J Med Chem 46: 4910-25 (2003)
Article DOI: 10.1021/jm020505v
BindingDB Entry DOI: 10.7270/Q2X929PJ