null
SMILES: Clc1cccc2c(ccnc12)N1CCN(CC1)C(=O)Nc1ccc(Oc2ccccc2)cc1
InChI Key: InChIKey=FLRNBHDOJNGVPK-UHFFFAOYSA-N
Activity Spreadsheet -- Enzyme Inhibition Constant Data from BindingDB
Found 1 hit for monomerid = 50134867
Trg + Lig
Ki
nM
ΔG°
kcal/mole
IC50
nM
Kd
nM
EC50/IC50
nM
koff
s-1
kon
M-1s-1
pHTemp
°C
Platelet-derived growth factor receptor beta
(Homo sapiens (Human))
BDBM50134867
(4-(8-Chloro-quinolin-4-yl)-piperazine-1-carboxylic...)
Show SMILES Clc1cccc2c(ccnc12)N1CCN(CC1)C(=O)Nc1ccc(Oc2ccccc2)cc1
Show InChI InChI=1S/C26H23ClN4O2/c27-23-8-4-7-22-24(13-14-28-25(22)23)30-15-17-31(18-16-30)26(32)29-19-9-11-21(12-10-19)33-20-5-2-1-3-6-20/h1-14H,15-18H2,(H,29,32)
NCI pathway
Reactome pathway
n/an/a>1.00E+4n/an/an/an/an/an/a
Pharmaceutical Research Institute
Curated by ChEMBL
Assay Description
Inhibition of platelet-derived growth factor receptor beta phosphorylation was measured in intact cells using a two-site enzyme linked immunosorbent ...
J Med Chem 46: 4910-25 (2003)
Article DOI: 10.1021/jm020505v
BindingDB Entry DOI: 10.7270/Q2X929PJ