BDBM50134875 4-(1,3-Dimethyl-2-oxo-2,3-dihydro-1H-imidazo[4,5-g]quinazolin-8-yl)-piperazine-1-carboxylic acid (4-phenoxy-phenyl)-amide::CHEMBL411229
SMILES: Cn1c2cc3ncnc(N4CCN(CC4)C(=O)Nc4ccc(Oc5ccccc5)cc4)c3cc2n(C)c1=O
InChI Key: InChIKey=KMUWSIMUXBVXPU-UHFFFAOYSA-N
Data: 1 IC50
Activity Spreadsheet -- Enzyme Inhibition Constant Data from BindingDB
Found 1 hit for monomerid = 50134875
Trg + Lig
Ki
nM
ΔG°
kcal/mole
IC50
nM
Kd
nM
EC50/IC50
nM
koff
s-1
kon
M-1s-1
pHTemp
°C
Platelet-derived growth factor receptor beta
(Homo sapiens (Human))
BDBM50134875
(4-(1,3-Dimethyl-2-oxo-2,3-dihydro-1H-imidazo[4,5-g...)
Show SMILES Cn1c2cc3ncnc(N4CCN(CC4)C(=O)Nc4ccc(Oc5ccccc5)cc4)c3cc2n(C)c1=O
Show InChI InChI=1S/C28H27N7O3/c1-32-24-16-22-23(17-25(24)33(2)28(32)37)29-18-30-26(22)34-12-14-35(15-13-34)27(36)31-19-8-10-21(11-9-19)38-20-6-4-3-5-7-20/h3-11,16-18H,12-15H2,1-2H3,(H,31,36)
NCI pathway
Reactome pathway
n/an/a 100n/an/an/an/an/an/a
Pharmaceutical Research Institute
Curated by ChEMBL
Assay Description
Inhibition of platelet-derived growth factor receptor beta phosphorylation was measured in intact cells using a two-site enzyme linked immunosorbent ...
J Med Chem 46: 4910-25 (2003)
Article DOI: 10.1021/jm020505v
BindingDB Entry DOI: 10.7270/Q2X929PJ