BDBM50134877 4-(7,8-Dihydro-[1,4]dioxino[2,3-g]quinazolin-4-yl)-piperazine-1-carbothioic acid benzylamide::CHEMBL147056
SMILES: S=C(NCc1ccccc1)N1CCN(CC1)c1ncnc2cc3OCCOc3cc12
InChI Key: InChIKey=RLKTVDWYLRYIFQ-UHFFFAOYSA-N
Data: 1 IC50
Activity Spreadsheet -- Enzyme Inhibition Constant Data from BindingDB
Found 1 hit for monomerid = 50134877
Trg + Lig
Ki
nM
ΔG°
kcal/mole
IC50
nM
Kd
nM
EC50/IC50
nM
koff
s-1
kon
M-1s-1
pHTemp
°C
Platelet-derived growth factor receptor beta
(Homo sapiens (Human))
BDBM50134877
(4-(7,8-Dihydro-[1,4]dioxino[2,3-g]quinazolin-4-yl)...)
Show SMILES S=C(NCc1ccccc1)N1CCN(CC1)c1ncnc2cc3OCCOc3cc12
Show InChI InChI=1S/C22H23N5O2S/c30-22(23-14-16-4-2-1-3-5-16)27-8-6-26(7-9-27)21-17-12-19-20(29-11-10-28-19)13-18(17)24-15-25-21/h1-5,12-13,15H,6-11,14H2,(H,23,30)
NCI pathway
Reactome pathway
n/an/a>3.00E+4n/an/an/an/an/an/a
Pharmaceutical Research Institute
Curated by ChEMBL
Assay Description
Inhibition of platelet-derived growth factor receptor beta phosphorylation was measured in intact cells using a two-site enzyme linked immunosorbent ...
J Med Chem 46: 4910-25 (2003)
Article DOI: 10.1021/jm020505v
BindingDB Entry DOI: 10.7270/Q2X929PJ