null
SMILES: Clc1ccc2c(ccnc2c1)N1CCN(CC1)C(=S)NCc1ccccc1
InChI Key: InChIKey=ZWPFOQMPRQZAOR-UHFFFAOYSA-N
Activity Spreadsheet -- Enzyme Inhibition Constant Data from BindingDB
Found 2 hits for monomerid = 50134880
Trg + Lig
Ki
nM
ΔG°
kcal/mole
IC50
nM
Kd
nM
EC50/IC50
nM
koff
s-1
kon
M-1s-1
pHTemp
°C
DNA gyrase subunit B
(Mycobacterium smegmatis)
BDBM50134880
(4-(7-Chloro-quinolin-4-yl)-piperazine-1-carbothioi...)
Show SMILES Clc1ccc2c(ccnc2c1)N1CCN(CC1)C(=S)NCc1ccccc1
Show InChI InChI=1S/C21H21ClN4S/c22-17-6-7-18-19(14-17)23-9-8-20(18)25-10-12-26(13-11-25)21(27)24-15-16-4-2-1-3-5-16/h1-9,14H,10-13,15H2,(H,24,27)
n/an/a 5.50E+3n/an/an/an/an/an/a
Birla Institute of Technology& Science-Pilani
Curated by ChEMBL
Assay Description
Inhibition of Mycobacterium smegmatis 155 6His-tagged DNA gyrase B catalytic domain ATPase activity expressed in Escherichia coli BL21 (DE3) pLysS ce...
Eur J Med Chem 122: 216-231 (2016)
Article DOI: 10.1016/j.ejmech.2016.06.042
BindingDB Entry DOI: 10.7270/Q2DB83TT
Platelet-derived growth factor receptor beta
(Homo sapiens (Human))
BDBM50134880
(4-(7-Chloro-quinolin-4-yl)-piperazine-1-carbothioi...)
Show SMILES Clc1ccc2c(ccnc2c1)N1CCN(CC1)C(=S)NCc1ccccc1
Show InChI InChI=1S/C21H21ClN4S/c22-17-6-7-18-19(14-17)23-9-8-20(18)25-10-12-26(13-11-25)21(27)24-15-16-4-2-1-3-5-16/h1-9,14H,10-13,15H2,(H,24,27)
NCI pathway
Reactome pathway
n/an/a>3.00E+4n/an/an/an/an/an/a
Pharmaceutical Research Institute
Curated by ChEMBL
Assay Description
Inhibition of platelet-derived growth factor receptor beta phosphorylation was measured in intact cells using a two-site enzyme linked immunosorbent ...
J Med Chem 46: 4910-25 (2003)
Article DOI: 10.1021/jm020505v
BindingDB Entry DOI: 10.7270/Q2X929PJ