BDBM50134899 4-[7-Methoxy-6-(2-methoxy-ethoxy)-quinazolin-4-yl]-piperazine-1-carboxylic acid (4-phenoxy-phenyl)-amide::CHEMBL144725
SMILES: COCCOc1cc2c(ncnc2cc1OC)N1CCN(CC1)C(=O)Nc1ccc(Oc2ccccc2)cc1
InChI Key: InChIKey=MKMZNVRSGQUTJK-UHFFFAOYSA-N
Data: 1 IC50
Activity Spreadsheet -- Enzyme Inhibition Constant Data from BindingDB
Found 1 hit for monomerid = 50134899
Trg + Lig
Ki
nM
ΔG°
kcal/mole
IC50
nM
Kd
nM
EC50/IC50
nM
koff
s-1
kon
M-1s-1
pHTemp
°C
Platelet-derived growth factor receptor beta
(Homo sapiens (Human))
BDBM50134899
(4-[7-Methoxy-6-(2-methoxy-ethoxy)-quinazolin-4-yl]...)
Show SMILES COCCOc1cc2c(ncnc2cc1OC)N1CCN(CC1)C(=O)Nc1ccc(Oc2ccccc2)cc1
Show InChI InChI=1S/C29H31N5O5/c1-36-16-17-38-27-18-24-25(19-26(27)37-2)30-20-31-28(24)33-12-14-34(15-13-33)29(35)32-21-8-10-23(11-9-21)39-22-6-4-3-5-7-22/h3-11,18-20H,12-17H2,1-2H3,(H,32,35)
NCI pathway
Reactome pathway
n/an/a 20n/an/an/an/an/an/a
Pharmaceutical Research Institute
Curated by ChEMBL
Assay Description
Inhibition of platelet-derived growth factor receptor beta phosphorylation was measured in intact cells using a two-site enzyme linked immunosorbent ...
J Med Chem 46: 4910-25 (2003)
Article DOI: 10.1021/jm020505v
BindingDB Entry DOI: 10.7270/Q2X929PJ