BDBM50134934 5-(7-Chloro-quinolin-4-ylamino)-2-ethylaminomethyl-phenol::CHEMBL146826::desethyl isoquine
SMILES: CCNCc1ccc(Nc2ccnc3cc(Cl)ccc23)cc1O
InChI Key: InChIKey=XWBLHPDICBKAEX-UHFFFAOYSA-N
Data: 6 IC50
Activity Spreadsheet -- Enzyme Inhibition Constant Data from BindingDB
Found 6 hits for monomerid = 50134934
Trg + Lig
Ki
nM
ΔG°
kcal/mole
IC50
nM
Kd
nM
EC50/IC50
nM
koff
s-1
kon
M-1s-1
pHTemp
°C
Cytochrome P450 3A4
(Homo sapiens (Human))
BDBM50134934
(5-(7-Chloro-quinolin-4-ylamino)-2-ethylaminomethyl...)
Show SMILES CCNCc1ccc(Nc2ccnc3cc(Cl)ccc23)cc1O
Show InChI InChI=1S/C18H18ClN3O/c1-2-20-11-12-3-5-14(10-18(12)23)22-16-7-8-21-17-9-13(19)4-6-15(16)17/h3-10,20,23H,2,11H2,1H3,(H,21,22)
Reactome pathway
n/an/a>1.00E+5n/an/an/an/an/an/a
University of Liverpool
Curated by ChEMBL
Assay Description
Inhibition of human recombinant CYP3A4 using N-N,diethyl-formamide as substrate
J Med Chem 52: 1408-15 (2010)
Article DOI: 10.1021/jm8012618
BindingDB Entry DOI: 10.7270/Q2348KCX
Cytochrome P450 1A
(Homo sapiens (Human))
BDBM50134934
(5-(7-Chloro-quinolin-4-ylamino)-2-ethylaminomethyl...)
Show SMILES CCNCc1ccc(Nc2ccnc3cc(Cl)ccc23)cc1O
Show InChI InChI=1S/C18H18ClN3O/c1-2-20-11-12-3-5-14(10-18(12)23)22-16-7-8-21-17-9-13(19)4-6-15(16)17/h3-10,20,23H,2,11H2,1H3,(H,21,22)
Reactome pathway
n/an/a 8.00E+3n/an/an/an/an/an/a
University of Liverpool
Curated by ChEMBL
Assay Description
Inhibition of human recombinant CYP1A2
J Med Chem 52: 1408-15 (2010)
Article DOI: 10.1021/jm8012618
BindingDB Entry DOI: 10.7270/Q2348KCX
Cytochrome P450 2D6
(Homo sapiens (Human))
BDBM50134934
(5-(7-Chloro-quinolin-4-ylamino)-2-ethylaminomethyl...)
Show SMILES CCNCc1ccc(Nc2ccnc3cc(Cl)ccc23)cc1O
Show InChI InChI=1S/C18H18ClN3O/c1-2-20-11-12-3-5-14(10-18(12)23)22-16-7-8-21-17-9-13(19)4-6-15(16)17/h3-10,20,23H,2,11H2,1H3,(H,21,22)
n/an/a 3.40E+3n/an/an/an/an/an/a
University of Liverpool
Curated by ChEMBL
Assay Description
Inhibition of human recombinant CYP2D6
J Med Chem 52: 1408-15 (2010)
Article DOI: 10.1021/jm8012618
BindingDB Entry DOI: 10.7270/Q2348KCX
Cytochrome P450 2C9
(Homo sapiens (Human))
BDBM50134934
(5-(7-Chloro-quinolin-4-ylamino)-2-ethylaminomethyl...)
Show SMILES CCNCc1ccc(Nc2ccnc3cc(Cl)ccc23)cc1O
Show InChI InChI=1S/C18H18ClN3O/c1-2-20-11-12-3-5-14(10-18(12)23)22-16-7-8-21-17-9-13(19)4-6-15(16)17/h3-10,20,23H,2,11H2,1H3,(H,21,22)
Reactome pathway
n/an/a>1.00E+5n/an/an/an/an/an/a
University of Liverpool
Curated by ChEMBL
Assay Description
Inhibition of human recombinant CYP2C9
J Med Chem 52: 1408-15 (2010)
Article DOI: 10.1021/jm8012618
BindingDB Entry DOI: 10.7270/Q2348KCX
Cytochrome P450 2C19
(Homo sapiens (Human))
BDBM50134934
(5-(7-Chloro-quinolin-4-ylamino)-2-ethylaminomethyl...)
Show SMILES CCNCc1ccc(Nc2ccnc3cc(Cl)ccc23)cc1O
Show InChI InChI=1S/C18H18ClN3O/c1-2-20-11-12-3-5-14(10-18(12)23)22-16-7-8-21-17-9-13(19)4-6-15(16)17/h3-10,20,23H,2,11H2,1H3,(H,21,22)
Reactome pathway
n/an/a 6.20E+4n/an/an/an/an/an/a
University of Liverpool
Curated by ChEMBL
Assay Description
Inhibition of human recombinant CYP2C19
J Med Chem 52: 1408-15 (2010)
Article DOI: 10.1021/jm8012618
BindingDB Entry DOI: 10.7270/Q2348KCX
Cytochrome P450 2C8
(Homo sapiens (Human))
BDBM50134934
(5-(7-Chloro-quinolin-4-ylamino)-2-ethylaminomethyl...)
Show SMILES CCNCc1ccc(Nc2ccnc3cc(Cl)ccc23)cc1O
Show InChI InChI=1S/C18H18ClN3O/c1-2-20-11-12-3-5-14(10-18(12)23)22-16-7-8-21-17-9-13(19)4-6-15(16)17/h3-10,20,23H,2,11H2,1H3,(H,21,22)
n/an/a 2.30E+4n/an/an/an/an/an/a
University of Liverpool
Curated by ChEMBL
Assay Description
Inhibition of human recombinant CYP2C8
J Med Chem 52: 1408-15 (2010)
Article DOI: 10.1021/jm8012618
BindingDB Entry DOI: 10.7270/Q2348KCX