BDBM50134936 2-(tert-Butylamino-methyl)-5-(7-chloro-quinolin-4-ylamino)-phenol::CHEMBL147806::N-tert-Butyl isoquine
SMILES: CC(C)(C)NCc1ccc(Nc2ccnc3cc(Cl)ccc23)cc1O
InChI Key: InChIKey=ZVMMVSSEAMUNGI-UHFFFAOYSA-N
Data: 6 IC50
Activity Spreadsheet -- Enzyme Inhibition Constant Data from BindingDB
Found 6 hits for monomerid = 50134936
Trg + Lig
Ki
nM
ΔG°
kcal/mole
IC50
nM
Kd
nM
EC50/IC50
nM
koff
s-1
kon
M-1s-1
pHTemp
°C
Cytochrome P450 3A4
(Homo sapiens (Human))
BDBM50134936
(2-(tert-Butylamino-methyl)-5-(7-chloro-quinolin-4-...)
Show SMILES CC(C)(C)NCc1ccc(Nc2ccnc3cc(Cl)ccc23)cc1O
Show InChI InChI=1S/C20H22ClN3O/c1-20(2,3)23-12-13-4-6-15(11-19(13)25)24-17-8-9-22-18-10-14(21)5-7-16(17)18/h4-11,23,25H,12H2,1-3H3,(H,22,24)
Reactome pathway
n/an/a>1.00E+5n/an/an/an/an/an/a
University of Liverpool
Curated by ChEMBL
Assay Description
Inhibition of human recombinant CYP3A4 using phenylpiperazinylmethylbenzylresofurin as substrate
J Med Chem 52: 1408-15 (2010)
Article DOI: 10.1021/jm8012618
BindingDB Entry DOI: 10.7270/Q2348KCX
Cytochrome P450 1A
(Homo sapiens (Human))
BDBM50134936
(2-(tert-Butylamino-methyl)-5-(7-chloro-quinolin-4-...)
Show SMILES CC(C)(C)NCc1ccc(Nc2ccnc3cc(Cl)ccc23)cc1O
Show InChI InChI=1S/C20H22ClN3O/c1-20(2,3)23-12-13-4-6-15(11-19(13)25)24-17-8-9-22-18-10-14(21)5-7-16(17)18/h4-11,23,25H,12H2,1-3H3,(H,22,24)
Reactome pathway
n/an/a 2.90E+4n/an/an/an/an/an/a
University of Liverpool
Curated by ChEMBL
Assay Description
Inhibition of human recombinant CYP1A2
J Med Chem 52: 1408-15 (2010)
Article DOI: 10.1021/jm8012618
BindingDB Entry DOI: 10.7270/Q2348KCX
Potassium voltage-gated channel subfamily H member 2
(Homo sapiens (Human))
BDBM50134936
(2-(tert-Butylamino-methyl)-5-(7-chloro-quinolin-4-...)
Show SMILES CC(C)(C)NCc1ccc(Nc2ccnc3cc(Cl)ccc23)cc1O
Show InChI InChI=1S/C20H22ClN3O/c1-20(2,3)23-12-13-4-6-15(11-19(13)25)24-17-8-9-22-18-10-14(21)5-7-16(17)18/h4-11,23,25H,12H2,1-3H3,(H,22,24)
Reactome pathway
n/an/a 7.50E+3n/an/an/an/an/an/a
University of Liverpool
Curated by ChEMBL
Assay Description
Inhibition of human cloned ERG
J Med Chem 52: 1408-15 (2010)
Article DOI: 10.1021/jm8012618
BindingDB Entry DOI: 10.7270/Q2348KCX
Cytochrome P450 2C19
(Homo sapiens (Human))
BDBM50134936
(2-(tert-Butylamino-methyl)-5-(7-chloro-quinolin-4-...)
Show SMILES CC(C)(C)NCc1ccc(Nc2ccnc3cc(Cl)ccc23)cc1O
Show InChI InChI=1S/C20H22ClN3O/c1-20(2,3)23-12-13-4-6-15(11-19(13)25)24-17-8-9-22-18-10-14(21)5-7-16(17)18/h4-11,23,25H,12H2,1-3H3,(H,22,24)
Reactome pathway
n/an/a 2.40E+4n/an/an/an/an/an/a
University of Liverpool
Curated by ChEMBL
Assay Description
Inhibition of human recombinant CYP2C19
J Med Chem 52: 1408-15 (2010)
Article DOI: 10.1021/jm8012618
BindingDB Entry DOI: 10.7270/Q2348KCX
Cytochrome P450 2D6
(Homo sapiens (Human))
BDBM50134936
(2-(tert-Butylamino-methyl)-5-(7-chloro-quinolin-4-...)
Show SMILES CC(C)(C)NCc1ccc(Nc2ccnc3cc(Cl)ccc23)cc1O
Show InChI InChI=1S/C20H22ClN3O/c1-20(2,3)23-12-13-4-6-15(11-19(13)25)24-17-8-9-22-18-10-14(21)5-7-16(17)18/h4-11,23,25H,12H2,1-3H3,(H,22,24)
n/an/a 3.00E+3n/an/an/an/an/an/a
University of Liverpool
Curated by ChEMBL
Assay Description
Inhibition of human recombinant CYP2D6
J Med Chem 52: 1408-15 (2010)
Article DOI: 10.1021/jm8012618
BindingDB Entry DOI: 10.7270/Q2348KCX
Cytochrome P450 2C8
(Homo sapiens (Human))
BDBM50134936
(2-(tert-Butylamino-methyl)-5-(7-chloro-quinolin-4-...)
Show SMILES CC(C)(C)NCc1ccc(Nc2ccnc3cc(Cl)ccc23)cc1O
Show InChI InChI=1S/C20H22ClN3O/c1-20(2,3)23-12-13-4-6-15(11-19(13)25)24-17-8-9-22-18-10-14(21)5-7-16(17)18/h4-11,23,25H,12H2,1-3H3,(H,22,24)
n/an/a 2.30E+4n/an/an/an/an/an/a
University of Liverpool
Curated by ChEMBL
Assay Description
Inhibition of human recombinant CYP2C8
J Med Chem 52: 1408-15 (2010)
Article DOI: 10.1021/jm8012618
BindingDB Entry DOI: 10.7270/Q2348KCX