null
SMILES: NC(=O)c1c(Nc2ccc(I)cc2F)cc(F)cc1Oc1cccc(F)c1NS(N)(=O)=O
InChI Key: InChIKey=JWIKHIUIWMSWID-UHFFFAOYSA-N
Activity Spreadsheet -- Enzyme Inhibition Constant Data from BindingDB
Found 1 hit for monomerid = 50134962
Trg + Lig
Ki
nM
ΔG°
kcal/mole
IC50
nM
Kd
nM
EC50/IC50
nM
koff
s-1
kon
M-1s-1
pHTemp
°C
Dual specificity mitogen-activated protein kinase kinase 1
(Homo sapiens (Human))
BDBM50134962
(CHEMBL3746158)
Show SMILES NC(=O)c1c(Nc2ccc(I)cc2F)cc(F)cc1Oc1cccc(F)c1NS(N)(=O)=O
Show InChI InChI=1S/C19H14F3IN4O4S/c20-9-6-14(26-13-5-4-10(23)8-12(13)22)17(19(24)28)16(7-9)31-15-3-1-2-11(21)18(15)27-32(25,29)30/h1-8,26-27H,(H2,24,28)(H2,25,29,30)
Reactome pathway
n/an/a 107n/an/an/an/an/an/a
Bayer HealthCare AG
Curated by ChEMBL
Assay Description
Inhibition of MEK1 (unknown origin) using biotinylated ERK1 as substrate incubated for 2 hrs by fluorescence analysis
Bioorg Med Chem Lett 26: 186-93 (2015)
BindingDB Entry DOI: 10.7270/Q26M38NN