null
SMILES: NC(=O)c1c(Nc2ccc(I)cc2F)cc(F)cc1Oc1cccc(CNS(N)(=O)=O)c1
InChI Key: InChIKey=SGVLAJYAPDCHSS-UHFFFAOYSA-N
Activity Spreadsheet -- Enzyme Inhibition Constant Data from BindingDB
Found 2 hits for monomerid = 50134969
Trg + Lig
Ki
nM
ΔG°
kcal/mole
IC50
nM
Kd
nM
EC50/IC50
nM
koff
s-1
kon
M-1s-1
pHTemp
°C
Carbonic anhydrase 2
(Homo sapiens (Human))
BDBM50134969
(CHEMBL3746923)
Show SMILES NC(=O)c1c(Nc2ccc(I)cc2F)cc(F)cc1Oc1cccc(CNS(N)(=O)=O)c1
Show InChI InChI=1S/C20H17F2IN4O4S/c21-12-7-17(27-16-5-4-13(23)9-15(16)22)19(20(24)28)18(8-12)31-14-3-1-2-11(6-14)10-26-32(25,29)30/h1-9,26-27H,10H2,(H2,24,28)(H2,25,29,30)
Reactome pathway
n/an/a 2.80E+3n/an/an/an/an/an/a
Bayer HealthCare AG
Curated by ChEMBL
Assay Description
Inhibition of human carbonic anhydrase 2
Bioorg Med Chem Lett 26: 186-93 (2015)
BindingDB Entry DOI: 10.7270/Q26M38NN
Dual specificity mitogen-activated protein kinase kinase 1
(Homo sapiens (Human))
BDBM50134969
(CHEMBL3746923)
Show SMILES NC(=O)c1c(Nc2ccc(I)cc2F)cc(F)cc1Oc1cccc(CNS(N)(=O)=O)c1
Show InChI InChI=1S/C20H17F2IN4O4S/c21-12-7-17(27-16-5-4-13(23)9-15(16)22)19(20(24)28)18(8-12)31-14-3-1-2-11(6-14)10-26-32(25,29)30/h1-9,26-27H,10H2,(H2,24,28)(H2,25,29,30)
Reactome pathway
n/an/a 37n/an/an/an/an/an/a
Bayer HealthCare AG
Curated by ChEMBL
Assay Description
Inhibition of MEK1 (unknown origin) using biotinylated ERK1 as substrate incubated for 2 hrs by fluorescence analysis
Bioorg Med Chem Lett 26: 186-93 (2015)
BindingDB Entry DOI: 10.7270/Q26M38NN