null
SMILES: Cc1c(NS(N)(=O)=O)cccc1Oc1cc(F)c(F)c(Nc2ccc(I)cc2F)c1C(N)=O
InChI Key: InChIKey=SXZPVVYAPXMNHZ-UHFFFAOYSA-N
Activity Spreadsheet -- Enzyme Inhibition Constant Data from BindingDB
Found 1 hit for monomerid = 50135016
Trg + Lig
Ki
nM
ΔG°
kcal/mole
IC50
nM
Kd
nM
EC50/IC50
nM
koff
s-1
kon
M-1s-1
pHTemp
°C
Dual specificity mitogen-activated protein kinase kinase 1
(Homo sapiens (Human))
BDBM50135016
(CHEMBL3747047)
Show SMILES Cc1c(NS(N)(=O)=O)cccc1Oc1cc(F)c(F)c(Nc2ccc(I)cc2F)c1C(N)=O
Show InChI InChI=1S/C20H16F3IN4O4S/c1-9-13(28-33(26,30)31)3-2-4-15(9)32-16-8-12(22)18(23)19(17(16)20(25)29)27-14-6-5-10(24)7-11(14)21/h2-8,27-28H,1H3,(H2,25,29)(H2,26,30,31)
Reactome pathway
n/an/a 14n/an/an/an/an/an/a
Bayer HealthCare AG
Curated by ChEMBL
Assay Description
Inhibition of MEK1 (unknown origin) using biotinylated ERK1 as substrate incubated for 2 hrs by fluorescence analysis
Bioorg Med Chem Lett 26: 186-93 (2015)
BindingDB Entry DOI: 10.7270/Q26M38NN