BDBM50135168 3,4,5-Trihydroxy-benzoic acid (2R,3S)-5,7-dihydroxy-2-(3,4,5-trihydroxy-phenyl)-chroman-3-yl ester::CHEMBL126079
SMILES: Oc1cc(O)c2C[C@H](OC(=O)c3cc(O)c(O)c(O)c3)[C@H](Oc2c1)c1cc(O)c(O)c(O)c1
InChI Key: InChIKey=WMBWREPUVVBILR-GHTZIAJQSA-N
Data: 1 KI  1 IC50
Activity Spreadsheet -- Enzyme Inhibition Constant Data from BindingDB
Found 2 hits for monomerid = 50135168
Trg + Lig
Ki
nM
ΔG°
kcal/mole
IC50
nM
Kd
nM
EC50/IC50
nM
koff
s-1
kon
M-1s-1
pHTemp
°C
Beta-secretase 1
(Homo sapiens (Human))
BDBM50135168
(3,4,5-Trihydroxy-benzoic acid (2R,3S)-5,7-dihydrox...)
Show SMILES Oc1cc(O)c2C[C@H](OC(=O)c3cc(O)c(O)c(O)c3)[C@H](Oc2c1)c1cc(O)c(O)c(O)c1 |r|
Show InChI InChI=1S/C22H18O11/c23-10-5-12(24)11-7-18(33-22(31)9-3-15(27)20(30)16(28)4-9)21(32-17(11)6-10)8-1-13(25)19(29)14(26)2-8/h1-6,18,21,23-30H,7H2/t18-,21+/m0/s1
170n/an/an/an/an/an/an/an/a
Kyungpook National University
Curated by ChEMBL
Assay Description
Inhibition of human Beta-secretase 1
Bioorg Med Chem Lett 13: 3905-8 (2003)
BindingDB Entry DOI: 10.7270/Q28K78HN
Beta-secretase 1
(Homo sapiens (Human))
BDBM50135168
(3,4,5-Trihydroxy-benzoic acid (2R,3S)-5,7-dihydrox...)
Show SMILES Oc1cc(O)c2C[C@H](OC(=O)c3cc(O)c(O)c(O)c3)[C@H](Oc2c1)c1cc(O)c(O)c(O)c1 |r|
Show InChI InChI=1S/C22H18O11/c23-10-5-12(24)11-7-18(33-22(31)9-3-15(27)20(30)16(28)4-9)21(32-17(11)6-10)8-1-13(25)19(29)14(26)2-8/h1-6,18,21,23-30H,7H2/t18-,21+/m0/s1
n/an/a 1.80E+3n/an/an/an/an/an/a
Kyungpook National University
Curated by ChEMBL
Assay Description
Inhibition of human Beta-secretase 1
Bioorg Med Chem Lett 13: 3905-8 (2003)
BindingDB Entry DOI: 10.7270/Q28K78HN