null
SMILES: COc1ccc2c(NC(=O)CI)c(oc2c1)C(=O)c1cc(OC)c(OC)c(OC)c1
InChI Key: InChIKey=RQMCCHYIYXATHS-UHFFFAOYSA-N
Activity Spreadsheet -- Enzyme Inhibition Constant Data from BindingDB
Found 1 hit for monomerid = 50135175
Trg + Lig
Ki
nM
ΔG°
kcal/mole
IC50
nM
Kd
nM
EC50/IC50
nM
koff
s-1
kon
M-1s-1
pHTemp
°C
Similar to alpha-tubulin isoform 1
(Bos taurus)
BDBM50135175
(CHEMBL490384)
Show SMILES COc1ccc2c(NC(=O)CI)c(oc2c1)C(=O)c1cc(OC)c(OC)c(OC)c1
Show InChI InChI=1S/C21H20INO7/c1-26-12-5-6-13-14(9-12)30-21(18(13)23-17(24)10-22)19(25)11-7-15(27-2)20(29-4)16(8-11)28-3/h5-9H,10H2,1-4H3,(H,23,24)
n/an/a 1.80E+3n/an/an/an/an/an/a
Universit£ di Ferrara
Curated by ChEMBL
Assay Description
Inhibition of bovine brain tubulin polymerization by spectrophotometry
Eur J Med Chem 108: 39-52 (2016)
BindingDB Entry DOI: 10.7270/Q2PN97GZ