BDBM50135213 CHEMBL3747016
SMILES: Cn1ccc(n1)-c1ccc(Cn2cc(C(=O)N[C@H]3CCOC[C@@H]3O)c3ncccc23)cc1
InChI Key: InChIKey=FQGJDGJXEZTKDW-UNMCSNQZSA-N
Data: 1 KI  4 EC50
Activity Spreadsheet -- Enzyme Inhibition Constant Data from BindingDB
Found 5 hits for monomerid = 50135213
Trg + Lig
Ki
nM
ΔG°
kcal/mole
IC50
nM
Kd
nM
EC50/IC50
nM
koff
s-1
kon
M-1s-1
pHTemp
°C
Muscarinic acetylcholine receptor M1
(Homo sapiens (Human))
BDBM50135213
(CHEMBL3747016)
Show SMILES Cn1ccc(n1)-c1ccc(Cn2cc(C(=O)N[C@H]3CCOC[C@@H]3O)c3ncccc23)cc1 |r|
Show InChI InChI=1S/C24H25N5O3/c1-28-11-8-19(27-28)17-6-4-16(5-7-17)13-29-14-18(23-21(29)3-2-10-25-23)24(31)26-20-9-12-32-15-22(20)30/h2-8,10-11,14,20,22,30H,9,12-13,15H2,1H3,(H,26,31)/t20-,22-/m0/s1
40n/an/an/an/an/an/an/an/a
Pfizer Inc.
Curated by ChEMBL
Assay Description
In vitro inhibitory activity against [3H]- (+)-3-PPP binding to Sigma opioid receptor in guinea pig brain membrane homogenates
J Med Chem 60: 6649-6663 (2017)
Article DOI: 10.1021/acs.jmedchem.7b00597
BindingDB Entry DOI: 10.7270/Q2ZK5JS0
Muscarinic acetylcholine receptor M1
(Homo sapiens (Human))
BDBM50135213
(CHEMBL3747016)
Show SMILES Cn1ccc(n1)-c1ccc(Cn2cc(C(=O)N[C@H]3CCOC[C@@H]3O)c3ncccc23)cc1 |r|
Show InChI InChI=1S/C24H25N5O3/c1-28-11-8-19(27-28)17-6-4-16(5-7-17)13-29-14-18(23-21(29)3-2-10-25-23)24(31)26-20-9-12-32-15-22(20)30/h2-8,10-11,14,20,22,30H,9,12-13,15H2,1H3,(H,26,31)/t20-,22-/m0/s1
n/an/an/an/a 55n/an/an/an/a
Pfizer Inc.
Curated by ChEMBL
Assay Description
Positive allosteric modulation of human muscarinic M1 receptor expressed in CHO cells assessed as increase in ACh-induced intracellular calcium level...
Bioorg Med Chem Lett 28: 2068-2073 (2018)
Article DOI: 10.1016/j.bmcl.2018.04.054
BindingDB Entry DOI: 10.7270/Q2TB19HB
Muscarinic acetylcholine receptor M1
(Homo sapiens (Human))
BDBM50135213
(CHEMBL3747016)
Show SMILES Cn1ccc(n1)-c1ccc(Cn2cc(C(=O)N[C@H]3CCOC[C@@H]3O)c3ncccc23)cc1 |r|
Show InChI InChI=1S/C24H25N5O3/c1-28-11-8-19(27-28)17-6-4-16(5-7-17)13-29-14-18(23-21(29)3-2-10-25-23)24(31)26-20-9-12-32-15-22(20)30/h2-8,10-11,14,20,22,30H,9,12-13,15H2,1H3,(H,26,31)/t20-,22-/m0/s1
n/an/an/an/a>1.00E+3n/an/an/an/a
Pfizer Inc.
Curated by ChEMBL
Assay Description
Agonist activity at human muscarinic acetylcholine receptor M1 expressed in CHO cells assessed as increase in calcium mobilization incubated for 10 m...
J Med Chem 60: 6649-6663 (2017)
Article DOI: 10.1021/acs.jmedchem.7b00597
BindingDB Entry DOI: 10.7270/Q2ZK5JS0
Muscarinic acetylcholine receptor M1
(Homo sapiens (Human))
BDBM50135213
(CHEMBL3747016)
Show SMILES Cn1ccc(n1)-c1ccc(Cn2cc(C(=O)N[C@H]3CCOC[C@@H]3O)c3ncccc23)cc1 |r|
Show InChI InChI=1S/C24H25N5O3/c1-28-11-8-19(27-28)17-6-4-16(5-7-17)13-29-14-18(23-21(29)3-2-10-25-23)24(31)26-20-9-12-32-15-22(20)30/h2-8,10-11,14,20,22,30H,9,12-13,15H2,1H3,(H,26,31)/t20-,22-/m0/s1
n/an/an/an/a 55n/an/an/an/a
Pfizer Inc.
Curated by ChEMBL
Assay Description
Positive allosteric modulation of human M1 receptor expressed in CHO cells assessed as acetylcholine-induced calcium mobilization by FLIPR assay
Bioorg Med Chem Lett 26: 650-5 (2016)
BindingDB Entry DOI: 10.7270/Q29C708F
Muscarinic acetylcholine receptor M1
(Homo sapiens (Human))
BDBM50135213
(CHEMBL3747016)
Show SMILES Cn1ccc(n1)-c1ccc(Cn2cc(C(=O)N[C@H]3CCOC[C@@H]3O)c3ncccc23)cc1 |r|
Show InChI InChI=1S/C24H25N5O3/c1-28-11-8-19(27-28)17-6-4-16(5-7-17)13-29-14-18(23-21(29)3-2-10-25-23)24(31)26-20-9-12-32-15-22(20)30/h2-8,10-11,14,20,22,30H,9,12-13,15H2,1H3,(H,26,31)/t20-,22-/m0/s1
n/an/an/an/a 55n/an/an/an/a
Pfizer Inc.
Curated by ChEMBL
Assay Description
Positive allosteric modulation of human muscarinic acetylcholine receptor M1 expressed in CHO cells assessed as increase in acetylcholine-induced cal...
J Med Chem 60: 6649-6663 (2017)
Article DOI: 10.1021/acs.jmedchem.7b00597
BindingDB Entry DOI: 10.7270/Q2ZK5JS0