null
SMILES: Cn1cncc1C(OCc1c(cc(C#N)c(=O)n1C)-c1cccc(F)c1F)c1ccc(cc1)C#N
InChI Key: InChIKey=GBZJRDYYHMFEPS-UHFFFAOYSA-N
Activity Spreadsheet -- Enzyme Inhibition Constant Data from BindingDB
Found 2 hits for monomerid = 50135371
Trg + Lig
Ki
nM
ΔG°
kcal/mole
IC50
nM
Kd
nM
EC50/IC50
nM
koff
s-1
kon
M-1s-1
pHTemp
°C
Geranylgeranyl transferase type-1 subunit beta/Protein farnesyltransferase/geranylgeranyltransferase type-1 subunit alpha
(Homo sapiens (Human))
BDBM50135371
(6-[(4-Cyano-phenyl)-(3-methyl-3H-imidazol-4-yl)-me...)
Show SMILES Cn1cncc1C(OCc1c(cc(C#N)c(=O)n1C)-c1cccc(F)c1F)c1ccc(cc1)C#N
Show InChI InChI=1S/C26H19F2N5O2/c1-32-15-31-13-22(32)25(17-8-6-16(11-29)7-9-17)35-14-23-20(10-18(12-30)26(34)33(23)2)19-4-3-5-21(27)24(19)28/h3-10,13,15,25H,14H2,1-2H3
n/an/a 3.40E+3n/an/an/an/an/an/a
Abbott Laboratories
Curated by ChEMBL
Assay Description
In vitro inhibitory activity of the compound against Geranylgeranyl transferase type I
Bioorg Med Chem Lett 13: 4001-5 (2003)
BindingDB Entry DOI: 10.7270/Q2H41QVX
Protein farnesyltransferase subunit beta/geranylgeranyltransferase type-1 subunit alpha
(Homo sapiens (Human))
BDBM50135371
(6-[(4-Cyano-phenyl)-(3-methyl-3H-imidazol-4-yl)-me...)
Show SMILES Cn1cncc1C(OCc1c(cc(C#N)c(=O)n1C)-c1cccc(F)c1F)c1ccc(cc1)C#N
Show InChI InChI=1S/C26H19F2N5O2/c1-32-15-31-13-22(32)25(17-8-6-16(11-29)7-9-17)35-14-23-20(10-18(12-30)26(34)33(23)2)19-4-3-5-21(27)24(19)28/h3-10,13,15,25H,14H2,1-2H3
Reactome pathway
n/an/a 6.30n/an/an/an/an/an/a
Abbott Laboratories
Curated by ChEMBL
Assay Description
In vitro inhibitory activity against farnesyltransferase (FT)
Bioorg Med Chem Lett 13: 4001-5 (2003)
BindingDB Entry DOI: 10.7270/Q2H41QVX