BDBM50135372 6-[(4-Cyano-phenyl)-(3-methyl-3H-imidazol-4-yl)-methoxymethyl]-5-(3-ethoxy-phenyl)-1-methyl-2-oxo-1,2-dihydro-pyridine-3-carbonitrile::CHEMBL336497
SMILES: CCOc1cccc(c1)-c1cc(C#N)c(=O)n(C)c1COC(c1cncn1C)c1ccc(cc1)C#N
InChI Key: InChIKey=VDAIFUYTPNJOFW-UHFFFAOYSA-N
Data: 2 IC50  1 EC50
Activity Spreadsheet -- Enzyme Inhibition Constant Data from BindingDB
Found 3 hits for monomerid = 50135372
Trg + Lig
Ki
nM
ΔG°
kcal/mole
IC50
nM
Kd
nM
EC50/IC50
nM
koff
s-1
kon
M-1s-1
pHTemp
°C
Protein Farnesyltransferase (PFT)
(Homo sapiens (Human))
BDBM50135372
(6-[(4-Cyano-phenyl)-(3-methyl-3H-imidazol-4-yl)-me...)
Show SMILES CCOc1cccc(c1)-c1cc(C#N)c(=O)n(C)c1COC(c1cncn1C)c1ccc(cc1)C#N
Show InChI InChI=1S/C28H25N5O3/c1-4-35-23-7-5-6-21(12-23)24-13-22(15-30)28(34)33(3)26(24)17-36-27(25-16-31-18-32(25)2)20-10-8-19(14-29)9-11-20/h5-13,16,18,27H,4,17H2,1-3H3
Reactome pathway
n/an/an/an/a 0.810n/an/an/an/a
Abbott Laboratories
Curated by ChEMBL
Assay Description
In vitro effective concentration of the compound against farnesyltransferase (FT)
Bioorg Med Chem Lett 13: 4001-5 (2003)
BindingDB Entry DOI: 10.7270/Q2H41QVX
Geranylgeranyl transferase type I beta subunit/Protein Farnesyltransferase (PFT)
(Homo sapiens (Human))
BDBM50135372
(6-[(4-Cyano-phenyl)-(3-methyl-3H-imidazol-4-yl)-me...)
Show SMILES CCOc1cccc(c1)-c1cc(C#N)c(=O)n(C)c1COC(c1cncn1C)c1ccc(cc1)C#N
Show InChI InChI=1S/C28H25N5O3/c1-4-35-23-7-5-6-21(12-23)24-13-22(15-30)28(34)33(3)26(24)17-36-27(25-16-31-18-32(25)2)20-10-8-19(14-29)9-11-20/h5-13,16,18,27H,4,17H2,1-3H3
n/an/a 1.50E+3n/an/an/an/an/an/a
Abbott Laboratories
Curated by ChEMBL
Assay Description
In vitro inhibitory activity of the compound against Geranylgeranyl transferase type I
Bioorg Med Chem Lett 13: 4001-5 (2003)
BindingDB Entry DOI: 10.7270/Q2H41QVX
Protein Farnesyltransferase (PFT)
(Homo sapiens (Human))
BDBM50135372
(6-[(4-Cyano-phenyl)-(3-methyl-3H-imidazol-4-yl)-me...)
Show SMILES CCOc1cccc(c1)-c1cc(C#N)c(=O)n(C)c1COC(c1cncn1C)c1ccc(cc1)C#N
Show InChI InChI=1S/C28H25N5O3/c1-4-35-23-7-5-6-21(12-23)24-13-22(15-30)28(34)33(3)26(24)17-36-27(25-16-31-18-32(25)2)20-10-8-19(14-29)9-11-20/h5-13,16,18,27H,4,17H2,1-3H3
Reactome pathway
n/an/a 0.670n/an/an/an/an/an/a
Abbott Laboratories
Curated by ChEMBL
Assay Description
In vitro inhibitory activity against farnesyltransferase (FT)
Bioorg Med Chem Lett 13: 4001-5 (2003)
BindingDB Entry DOI: 10.7270/Q2H41QVX