null
SMILES: Cn1cncc1C(OCc1[nH]c(=O)c(cc1-c1cccc(Cl)c1)C#N)c1ccc(cc1)C#N
InChI Key: InChIKey=HYDRIOWWHJJSSW-UHFFFAOYSA-N
Activity Spreadsheet -- Enzyme Inhibition Constant Data from BindingDB
Found 3 hits for monomerid = 50135381
Trg + Lig
Ki
nM
ΔG°
kcal/mole
IC50
nM
Kd
nM
EC50/IC50
nM
koff
s-1
kon
M-1s-1
pHTemp
°C
Protein farnesyltransferase subunit beta/geranylgeranyltransferase type-1 subunit alpha
(Homo sapiens (Human))
BDBM50135381
(5-(3-Chloro-phenyl)-6-[(4-cyano-phenyl)-(3-methyl-...)
Show SMILES Cn1cncc1C(OCc1[nH]c(=O)c(cc1-c1cccc(Cl)c1)C#N)c1ccc(cc1)C#N
Show InChI InChI=1S/C25H18ClN5O2/c1-31-15-29-13-23(31)24(17-7-5-16(11-27)6-8-17)33-14-22-21(10-19(12-28)25(32)30-22)18-3-2-4-20(26)9-18/h2-10,13,15,24H,14H2,1H3,(H,30,32)
Reactome pathway
n/an/a 0.850n/an/an/an/an/an/a
Abbott Laboratories
Curated by ChEMBL
Assay Description
In vitro inhibitory activity against farnesyltransferase (FT)
Bioorg Med Chem Lett 13: 4001-5 (2003)
BindingDB Entry DOI: 10.7270/Q2H41QVX
Geranylgeranyl transferase type-1 subunit beta/Protein farnesyltransferase/geranylgeranyltransferase type-1 subunit alpha
(Homo sapiens (Human))
BDBM50135381
(5-(3-Chloro-phenyl)-6-[(4-cyano-phenyl)-(3-methyl-...)
Show SMILES Cn1cncc1C(OCc1[nH]c(=O)c(cc1-c1cccc(Cl)c1)C#N)c1ccc(cc1)C#N
Show InChI InChI=1S/C25H18ClN5O2/c1-31-15-29-13-23(31)24(17-7-5-16(11-27)6-8-17)33-14-22-21(10-19(12-28)25(32)30-22)18-3-2-4-20(26)9-18/h2-10,13,15,24H,14H2,1H3,(H,30,32)
n/an/a 820n/an/an/an/an/an/a
Abbott Laboratories
Curated by ChEMBL
Assay Description
In vitro inhibitory activity of the compound against Geranylgeranyl transferase type I
Bioorg Med Chem Lett 13: 4001-5 (2003)
BindingDB Entry DOI: 10.7270/Q2H41QVX
Protein farnesyltransferase subunit beta/geranylgeranyltransferase type-1 subunit alpha
(Homo sapiens (Human))
BDBM50135381
(5-(3-Chloro-phenyl)-6-[(4-cyano-phenyl)-(3-methyl-...)
Show SMILES Cn1cncc1C(OCc1[nH]c(=O)c(cc1-c1cccc(Cl)c1)C#N)c1ccc(cc1)C#N
Show InChI InChI=1S/C25H18ClN5O2/c1-31-15-29-13-23(31)24(17-7-5-16(11-27)6-8-17)33-14-22-21(10-19(12-28)25(32)30-22)18-3-2-4-20(26)9-18/h2-10,13,15,24H,14H2,1H3,(H,30,32)
Reactome pathway
n/an/an/an/a>100n/an/an/an/a
Abbott Laboratories
Curated by ChEMBL
Assay Description
In vitro effective concentration of the compound against farnesyltransferase (FT)
Bioorg Med Chem Lett 13: 4001-5 (2003)
BindingDB Entry DOI: 10.7270/Q2H41QVX