BDBM50135396 CHEMBL336544::[5-(2,4-Dichloro-phenylcarbamoyl)-4-methyl-thiazol-2-yl]-carbamic acid tert-butyl ester
SMILES: Cc1nc(NC(=O)OC(C)(C)C)sc1C(=O)Nc1ccc(Cl)cc1Cl
InChI Key: InChIKey=RAMUHAXWUVSEGZ-UHFFFAOYSA-N
Data: 1 IC50
Activity Spreadsheet -- Enzyme Inhibition Constant Data from BindingDB
Found 1 hit for monomerid = 50135396
Trg + Lig
Ki
nM
ΔG°
kcal/mole
IC50
nM
Kd
nM
EC50/IC50
nM
koff
s-1
kon
M-1s-1
pHTemp
°C
Tyrosine-protein kinase LCK
(Mus musculus)
BDBM50135396
(CHEMBL336544 | [5-(2,4-Dichloro-phenylcarbamoyl)-4...)
Show SMILES Cc1nc(NC(=O)OC(C)(C)C)sc1C(=O)Nc1ccc(Cl)cc1Cl
Show InChI InChI=1S/C16H17Cl2N3O3S/c1-8-12(13(22)20-11-6-5-9(17)7-10(11)18)25-14(19-8)21-15(23)24-16(2,3)4/h5-7H,1-4H3,(H,20,22)(H,19,21,23)
Reactome pathway
n/an/a>5.00E+4n/an/an/an/an/an/a
Bristol-Myers Squibb Pharmaceutical Research Institute
Curated by ChEMBL
Assay Description
In vitro inhibition of murine Lck kinase.
Bioorg Med Chem Lett 13: 4007-10 (2003)
BindingDB Entry DOI: 10.7270/Q2CC103J