null
SMILES: Cn1c2nc(Nc3ccc4[nH]ccc4c3)ncc2cc(c1=O)S(=O)(=O)c1ccc(O)cc1
InChI Key: InChIKey=FCPZOGCMAQOPBZ-UHFFFAOYSA-N
Activity Spreadsheet -- Enzyme Inhibition Constant Data from BindingDB
Found 1 hit for monomerid = 50135411
Trg + Lig
Ki
nM
ΔG°
kcal/mole
IC50
nM
Kd
nM
EC50/IC50
nM
koff
s-1
kon
M-1s-1
pHTemp
°C
Serine/threonine-protein kinase PLK2
(Homo sapiens (Human))
BDBM50135411
(CHEMBL3746075)
Show SMILES Cn1c2nc(Nc3ccc4[nH]ccc4c3)ncc2cc(c1=O)S(=O)(=O)c1ccc(O)cc1
Show InChI InChI=1S/C22H17N5O4S/c1-27-20-14(11-19(21(27)29)32(30,31)17-5-3-16(28)4-6-17)12-24-22(26-20)25-15-2-7-18-13(10-15)8-9-23-18/h2-12,23,28H,1H3,(H,24,25,26)
NCI pathway
n/an/a 470n/an/an/an/an/an/a
Icahn School of Medicine at Mount Sinai
Curated by ChEMBL
Assay Description
Inhibition of human recombinant PLK2 using recombinant dephosphorylated bovine alpha- casein as substrate after 30 mins by scintillation counting ana...
Bioorg Med Chem 24: 521-44 (2016)
BindingDB Entry DOI: 10.7270/Q24Q7WT8