BDBM50135424 CHEMBL3747595
SMILES: COc1ccc(cc1)S(=O)(=O)c1cc2cnc(Nc3ccc4[nH]ccc4c3)nc2n(C)c1=O
InChI Key: InChIKey=VAKARYFWENOUDM-UHFFFAOYSA-N
Data: 1 IC50
Activity Spreadsheet -- Enzyme Inhibition Constant Data from BindingDB
Found 1 hit for monomerid = 50135424
Trg + Lig
Ki
nM
ΔG°
kcal/mole
IC50
nM
Kd
nM
EC50/IC50
nM
koff
s-1
kon
M-1s-1
pHTemp
°C
Serine/threonine-protein kinase PLK2
(Homo sapiens (Human))
BDBM50135424
(CHEMBL3747595)
Show SMILES COc1ccc(cc1)S(=O)(=O)c1cc2cnc(Nc3ccc4[nH]ccc4c3)nc2n(C)c1=O
Show InChI InChI=1S/C23H19N5O4S/c1-28-21-15(12-20(22(28)29)33(30,31)18-6-4-17(32-2)5-7-18)13-25-23(27-21)26-16-3-8-19-14(11-16)9-10-24-19/h3-13,24H,1-2H3,(H,25,26,27)
NCI pathway
n/an/a 350n/an/an/an/an/an/a
Icahn School of Medicine at Mount Sinai
Curated by ChEMBL
Assay Description
Inhibition of human recombinant PLK2 using recombinant dephosphorylated bovine alpha- casein as substrate after 30 mins by scintillation counting ana...
Bioorg Med Chem 24: 521-44 (2016)
BindingDB Entry DOI: 10.7270/Q24Q7WT8