BDBM50135503 5-Fluoro-3-methyl-benzo[b]thiophene-2-sulfonic acid (4-formyl-2-methanesulfonyl-phenyl)-amide::CHEMBL335988
SMILES: Cc1c(sc2ccc(F)cc12)S(=O)(=O)Nc1ccc(C=O)cc1S(C)(=O)=O
InChI Key: InChIKey=IEDZVQZMBKBDGW-UHFFFAOYSA-N
Data: 1 IC50
Activity Spreadsheet -- Enzyme Inhibition Constant Data from BindingDB
Found 1 hit for monomerid = 50135503
Trg + Lig
Ki
nM
ΔG°
kcal/mole
IC50
nM
Kd
nM
EC50/IC50
nM
koff
s-1
kon
M-1s-1
pHTemp
°C
Chymase
(Homo sapiens (Human))
BDBM50135503
(5-Fluoro-3-methyl-benzo[b]thiophene-2-sulfonic aci...)
Show SMILES Cc1c(sc2ccc(F)cc12)S(=O)(=O)Nc1ccc(C=O)cc1S(C)(=O)=O
Show InChI InChI=1S/C17H14FNO5S3/c1-10-13-8-12(18)4-6-15(13)25-17(10)27(23,24)19-14-5-3-11(9-20)7-16(14)26(2,21)22/h3-9,19H,1-2H3
Reactome pathway
n/an/a>1.00E+3n/an/an/an/an/an/a
Toa Eiyo Ltd.
Curated by ChEMBL
Assay Description
In vitro inhibitory activity against human chymase
Bioorg Med Chem Lett 13: 4085-8 (2003)
BindingDB Entry DOI: 10.7270/Q2QN665P