null
SMILES: OP(O)(=O)C(Nc1cccnc1)P(O)(O)=O
InChI Key: InChIKey=IFOAJHQSAXHBDS-UHFFFAOYSA-N
Activity Spreadsheet -- Enzyme Inhibition Constant Data from BindingDB
Found 4 hits for monomerid = 50135818
Trg + Lig
Ki
nM
ΔG°
kcal/mole
IC50
nM
Kd
nM
EC50/IC50
nM
koff
s-1
kon
M-1s-1
pHTemp
°C
Farnesyl pyrophosphate synthase
(Homo sapiens (Human))
BDBM50135818
((pyridin-3-ylamino)methylenediphosphonic acid | 3-...)
Show SMILES OP(O)(=O)C(Nc1cccnc1)P(O)(O)=O
Show InChI InChI=1S/C6H10N2O6P2/c9-15(10,11)6(16(12,13)14)8-5-2-1-3-7-4-5/h1-4,6,8H,(H2,9,10,11)(H2,12,13,14)
Reactome pathway
15n/an/an/an/an/an/an/an/a
University of Illinois at Urbana-Champaign
Curated by ChEMBL
Assay Description
Binding affinity towards farnesyl Pyrophosphate Synthase using [14C]- isopentenyl pyrophosphate as radioligand
J Med Chem 46: 5171-83 (2003)
Article DOI: 10.1021/jm0302344
BindingDB Entry DOI: 10.7270/Q24M93Z8
Farnesyl pyrophosphate synthase
(Homo sapiens (Human))
BDBM50135818
((pyridin-3-ylamino)methylenediphosphonic acid | 3-...)
Show SMILES OP(O)(=O)C(Nc1cccnc1)P(O)(O)=O
Show InChI InChI=1S/C6H10N2O6P2/c9-15(10,11)6(16(12,13)14)8-5-2-1-3-7-4-5/h1-4,6,8H,(H2,9,10,11)(H2,12,13,14)
Reactome pathway
n/an/a 158n/an/an/an/an/an/a
University of Illinois at Urbana-Champaign
Curated by ChEMBL
Assay Description
Inhibitory activity against farnesyl Pyrophosphate Synthase expressed as #NAME? (M)
J Med Chem 46: 5171-83 (2003)
Article DOI: 10.1021/jm0302344
BindingDB Entry DOI: 10.7270/Q24M93Z8
Polyprenyl synthetase family protein
(Plasmodium falciparum (isolate 3D7))
BDBM50135818
((pyridin-3-ylamino)methylenediphosphonic acid | 3-...)
Show SMILES OP(O)(=O)C(Nc1cccnc1)P(O)(O)=O
Show InChI InChI=1S/C6H10N2O6P2/c9-15(10,11)6(16(12,13)14)8-5-2-1-3-7-4-5/h1-4,6,8H,(H2,9,10,11)(H2,12,13,14)
n/an/a 160n/an/an/an/an/an/a
University of Illinois at Urbana-Champaign
Curated by ChEMBL
Assay Description
Inhibitory activity against Leishmania major Farnesyl diphosphate synthase
J Med Chem 47: 175-87 (2003)
Article DOI: 10.1021/jm030084x
BindingDB Entry DOI: 10.7270/Q2FN15N5
Farnesyl pyrophosphate synthase
(Homo sapiens (Human))
BDBM50135818
((pyridin-3-ylamino)methylenediphosphonic acid | 3-...)
Show SMILES OP(O)(=O)C(Nc1cccnc1)P(O)(O)=O
Show InChI InChI=1S/C6H10N2O6P2/c9-15(10,11)6(16(12,13)14)8-5-2-1-3-7-4-5/h1-4,6,8H,(H2,9,10,11)(H2,12,13,14)
Reactome pathway
n/an/a 160n/an/an/an/an/an/a
University of Illinois at Urbana-Champaign
Curated by ChEMBL
Assay Description
Inhibitory activity against farnesyl Pyrophosphate Synthase was determined
J Med Chem 46: 5171-83 (2003)
Article DOI: 10.1021/jm0302344
BindingDB Entry DOI: 10.7270/Q24M93Z8