BDBM50135824 (Bis-phosphono-methyl)-cyclopentyl-ammonium::(Cyclopentylamino-phosphono-methyl)-phosphonic acid::(cyclopentylamino)methylenediphosphonic acid::CHEMBL58830::cyclopentylaminomethylene-1,1-bisphosphonate
SMILES: OP(O)(O)C(=NC1CCCC1)P(O)(O)=O
InChI Key: InChIKey=NBTSAPCYHIZNTR-UHFFFAOYSA-N
Data: 1 KI  3 IC50
Activity Spreadsheet -- Enzyme Inhibition Constant Data from BindingDB
Found 4 hits for monomerid = 50135824
Trg + Lig
Ki
nM
ΔG°
kcal/mole
IC50
nM
Kd
nM
EC50/IC50
nM
koff
s-1
kon
M-1s-1
pHTemp
°C
Farnesyl diphosphate synthase
(Homo sapiens (Human))
BDBM50135824
((Bis-phosphono-methyl)-cyclopentyl-ammonium | (Cyc...)
Show SMILES OP(O)(O)C(=NC1CCCC1)P(O)(O)=O |w:5.5|
Show InChI InChI=1S/C6H15NO6P2/c8-14(9,10)6(15(11,12)13)7-5-3-1-2-4-5/h5,8-10,14H,1-4H2,(H2,11,12,13)
Reactome pathway
52n/an/an/an/an/an/an/an/a
University of Illinois at Urbana-Champaign
Curated by ChEMBL
Assay Description
Binding affinity towards farnesyl Pyrophosphate Synthase using [14C]- isopentenyl pyrophosphate as radioligand
J Med Chem 46: 5171-83 (2003)
Article DOI: 10.1021/jm0302344
BindingDB Entry DOI: 10.7270/Q24M93Z8
Farnesyl pyrophosphate synthase
(Plasmodium falciparum (isolate 3D7))
BDBM50135824
((Bis-phosphono-methyl)-cyclopentyl-ammonium | (Cyc...)
Show SMILES OP(O)(O)C(=NC1CCCC1)P(O)(O)=O |w:5.5|
Show InChI InChI=1S/C6H15NO6P2/c8-14(9,10)6(15(11,12)13)7-5-3-1-2-4-5/h5,8-10,14H,1-4H2,(H2,11,12,13)
n/an/a 540n/an/an/an/an/an/a
University of Illinois at Urbana-Champaign
Curated by ChEMBL
Assay Description
Inhibitory activity against Leishmania major Farnesyl diphosphate synthase
J Med Chem 47: 175-87 (2003)
Article DOI: 10.1021/jm030084x
BindingDB Entry DOI: 10.7270/Q2FN15N5
Farnesyl diphosphate synthase
(Homo sapiens (Human))
BDBM50135824
((Bis-phosphono-methyl)-cyclopentyl-ammonium | (Cyc...)
Show SMILES OP(O)(O)C(=NC1CCCC1)P(O)(O)=O |w:5.5|
Show InChI InChI=1S/C6H15NO6P2/c8-14(9,10)6(15(11,12)13)7-5-3-1-2-4-5/h5,8-10,14H,1-4H2,(H2,11,12,13)
Reactome pathway
n/an/a 537n/an/an/an/an/an/a
University of Illinois at Urbana-Champaign
Curated by ChEMBL
Assay Description
Inhibitory activity against farnesyl Pyrophosphate Synthase expressed as #NAME? (M)
J Med Chem 46: 5171-83 (2003)
Article DOI: 10.1021/jm0302344
BindingDB Entry DOI: 10.7270/Q24M93Z8
Farnesyl diphosphate synthase
(Homo sapiens (Human))
BDBM50135824
((Bis-phosphono-methyl)-cyclopentyl-ammonium | (Cyc...)
Show SMILES OP(O)(O)C(=NC1CCCC1)P(O)(O)=O |w:5.5|
Show InChI InChI=1S/C6H15NO6P2/c8-14(9,10)6(15(11,12)13)7-5-3-1-2-4-5/h5,8-10,14H,1-4H2,(H2,11,12,13)
Reactome pathway
n/an/a 540n/an/an/an/an/an/a
University of Illinois at Urbana-Champaign
Curated by ChEMBL
Assay Description
Inhibitory activity against farnesyl Pyrophosphate Synthase was determined
J Med Chem 46: 5171-83 (2003)
Article DOI: 10.1021/jm0302344
BindingDB Entry DOI: 10.7270/Q24M93Z8