BDBM50136019 9-ethoxymethyl-12-(3-hydroxypropyl)-6,7,12,13-tetrahydro-5H-indeno[2,1-a]pyrrolo[4,3-c]carbazol-5-one::CHEMBL424323
SMILES: CCOCc1ccc2n(CCCO)c3c4Cc5ccccc5-c4c4C(=O)NCc4c3c2c1
InChI Key: InChIKey=GCQLZLWVEQWWHJ-UHFFFAOYSA-N
Data: 1 IC50
Activity Spreadsheet -- Enzyme Inhibition Constant Data from BindingDB
Found 1 hit for monomerid = 50136019
Trg + Lig
Ki
nM
ΔG°
kcal/mole
IC50
nM
Kd
nM
EC50/IC50
nM
koff
s-1
kon
M-1s-1
pHTemp
°C
Vascular endothelial growth factor receptor 2
(Homo sapiens (Human))
BDBM50136019
(9-ethoxymethyl-12-(3-hydroxypropyl)-6,7,12,13-tetr...)
Show SMILES CCOCc1ccc2n(CCCO)c3c4Cc5ccccc5-c4c4C(=O)NCc4c3c2c1
Show InChI InChI=1S/C27H26N2O3/c1-2-32-15-16-8-9-22-19(12-16)24-21-14-28-27(31)25(21)23-18-7-4-3-6-17(18)13-20(23)26(24)29(22)10-5-11-30/h3-4,6-9,12,30H,2,5,10-11,13-15H2,1H3,(H,28,31)
NCI pathway
Reactome pathway
n/an/a 4n/an/an/an/an/an/a
Cephalon, Inc
Curated by ChEMBL
Assay Description
Inhibition of human Vascular endothelial growth factor receptor 2
J Med Chem 46: 5375-88 (2003)
Article DOI: 10.1021/jm0301641
BindingDB Entry DOI: 10.7270/Q2V69J1X