BDBM50136247 (S)-3-(2,3-Dihydro-benzofuran-6-yl)-3-{(R)-2-oxo-3-[3-(5,6,7,8-tetrahydro-[1,8]naphthyridin-2-yl)-propyl]-pyrrolidin-1-yl}-propionic acid::CHEMBL135757
SMILES: OC(=O)C[C@H](N1CC[C@@H](CCCc2ccc3CCCNc3n2)C1=O)c1ccc2CCOc2c1
InChI Key: InChIKey=YWGKJZDMSJRNNY-KNQAVFIVSA-N
Data: 1 IC50
Activity Spreadsheet -- Enzyme Inhibition Constant Data from BindingDB
Found 1 hit for monomerid = 50136247
Trg + Lig
Ki
nM
ΔG°
kcal/mole
IC50
nM
Kd
nM
EC50/IC50
nM
koff
s-1
kon
M-1s-1
pHTemp
°C
Integrin alpha-V/beta-3
(Homo sapiens (Human))
BDBM50136247
((S)-3-(2,3-Dihydro-benzofuran-6-yl)-3-{(R)-2-oxo-3...)
Show SMILES OC(=O)C[C@H](N1CC[C@@H](CCCc2ccc3CCCNc3n2)C1=O)c1ccc2CCOc2c1
Show InChI InChI=1S/C26H31N3O4/c30-24(31)16-22(20-7-6-17-11-14-33-23(17)15-20)29-13-10-19(26(29)32)3-1-5-21-9-8-18-4-2-12-27-25(18)28-21/h6-9,15,19,22H,1-5,10-14,16H2,(H,27,28)(H,30,31)/t19-,22+/m1/s1
n/an/a 0.390n/an/an/an/an/an/a
Merck Research Laboratories
Curated by ChEMBL
Assay Description
Displacement of [125I]-labeled nonpeptide from purified recombinant human alphaV-beta3 integrin
Bioorg Med Chem Lett 13: 4285-8 (2003)
BindingDB Entry DOI: 10.7270/Q25D8T08