BDBM50136390 CHEMBL3754018
SMILES: CC(C)Nc1cc(cc(C)n1)-c1nc(no1)-c1cc(F)c(OC[C@H]2COC(=O)N2)cc1Cl
InChI Key: InChIKey=QBJCFCYZENEIJY-ZDUSSCGKSA-N
Data: 1 EC50
Activity Spreadsheet -- Enzyme Inhibition Constant Data from BindingDB
Found 1 hit for monomerid = 50136390
Trg + Lig
Ki
nM
ΔG°
kcal/mole
IC50
nM
Kd
nM
EC50/IC50
nM
koff
s-1
kon
M-1s-1
pHTemp
°C
Sphingosine 1-phosphate receptor 1
(Homo sapiens (Human))
BDBM50136390
(CHEMBL3754018)
Show SMILES CC(C)Nc1cc(cc(C)n1)-c1nc(no1)-c1cc(F)c(OC[C@H]2COC(=O)N2)cc1Cl |r|
Show InChI InChI=1S/C21H21ClFN5O4/c1-10(2)24-18-5-12(4-11(3)25-18)20-27-19(28-32-20)14-6-16(23)17(7-15(14)22)30-8-13-9-31-21(29)26-13/h4-7,10,13H,8-9H2,1-3H3,(H,24,25)(H,26,29)/t13-/m0/s1
Reactome pathway
n/an/an/an/a 0.600n/an/an/an/a
Boehringer Ingelheim Pharmaceuticals
Curated by ChEMBL
Assay Description
Agonist activity at human S1P1 receptor expressed in EDG1-bla U2OS cells incubated for 18 hrs prior to GenBlazer substrate addition by beta-arrestin ...
Bioorg Med Chem Lett 26: 466-71 (2016)
BindingDB Entry DOI: 10.7270/Q2GX4DD4