BDBM50136561 CHEMBL3752137
SMILES: CC(C)Oc1cc(cc(C)n1)-c1nnc(s1)-c1cc(F)c(OC[C@H](N)CO)cc1Cl
InChI Key: InChIKey=OAPXAIALAGVOLO-CYBMUJFWSA-N
Data: 1 EC50
Activity Spreadsheet -- Enzyme Inhibition Constant Data from BindingDB
Found 1 hit for monomerid = 50136561
Trg + Lig
Ki
nM
ΔG°
kcal/mole
IC50
nM
Kd
nM
EC50/IC50
nM
koff
s-1
kon
M-1s-1
pHTemp
°C
Sphingosine 1-phosphate receptor 1
(Homo sapiens (Human))
BDBM50136561
(CHEMBL3752137)
Show SMILES CC(C)Oc1cc(cc(C)n1)-c1nnc(s1)-c1cc(F)c(OC[C@H](N)CO)cc1Cl |r|
Show InChI InChI=1S/C20H22ClFN4O3S/c1-10(2)29-18-5-12(4-11(3)24-18)19-25-26-20(30-19)14-6-16(22)17(7-15(14)21)28-9-13(23)8-27/h4-7,10,13,27H,8-9,23H2,1-3H3/t13-/m1/s1
Reactome pathway
n/an/an/an/a 130n/an/an/an/a
Boehringer Ingelheim Pharmaceuticals
Curated by ChEMBL
Assay Description
Agonist activity at human S1P1 receptor expressed in EDG1-bla U2OS cells incubated for 18 hrs prior to GenBlazer substrate addition by beta-arrestin ...
Bioorg Med Chem Lett 26: 466-71 (2016)
BindingDB Entry DOI: 10.7270/Q2GX4DD4