BDBM50136693 (+/-)-2-benzyl-1-(6,7-dimethoxy-3,4-dihydroisoquinolin-2(1H)-yl)-3,3-dimethylbutan-1-one::2-Benzyl-1-(6,7-dimethoxy-3,4-dihydro-1H-isoquinolin-2-yl)-3,3-dimethyl-butan-1-one::CHEMBL139083
SMILES: COc1cc2CCN(Cc2cc1OC)C(=O)C(Cc1ccccc1)C(C)(C)C
InChI Key: InChIKey=QBEZKPQJLYALCQ-UHFFFAOYSA-N
Data: 4 IC50
Activity Spreadsheet -- Enzyme Inhibition Constant Data from BindingDB
Found 4 hits for monomerid = 50136693
Trg + Lig
Ki
nM
ΔG°
kcal/mole
IC50
nM
Kd
nM
EC50/IC50
nM
koff
s-1
kon
M-1s-1
pHTemp
°C
Orexin receptor type 2
(Homo sapiens (Human))
BDBM50136693
((+/-)-2-benzyl-1-(6,7-dimethoxy-3,4-dihydroisoquin...)
Show SMILES COc1cc2CCN(Cc2cc1OC)C(=O)C(Cc1ccccc1)C(C)(C)C
Show InChI InChI=1S/C24H31NO3/c1-24(2,3)20(13-17-9-7-6-8-10-17)23(26)25-12-11-18-14-21(27-4)22(28-5)15-19(18)16-25/h6-10,14-15,20H,11-13,16H2,1-5H3
Reactome pathway
n/an/a 56n/an/an/an/an/an/a
Banyu Tsukuba Research Institute
Curated by ChEMBL
Assay Description
Inhibitory concentration against human orexin-2 receptor (hOX2R)
Bioorg Med Chem Lett 13: 4497-9 (2003)
BindingDB Entry DOI: 10.7270/Q20R9NT7
Orexin receptor type 2
(Homo sapiens (Human))
BDBM50136693
((+/-)-2-benzyl-1-(6,7-dimethoxy-3,4-dihydroisoquin...)
Show SMILES COc1cc2CCN(Cc2cc1OC)C(=O)C(Cc1ccccc1)C(C)(C)C
Show InChI InChI=1S/C24H31NO3/c1-24(2,3)20(13-17-9-7-6-8-10-17)23(26)25-12-11-18-14-21(27-4)22(28-5)15-19(18)16-25/h6-10,14-15,20H,11-13,16H2,1-5H3
Reactome pathway
n/an/a 56n/an/an/an/an/an/a
Actelion Pharmaceuticals Ltd.
Curated by ChEMBL
Assay Description
Antagonist activity at human OX2 receptor
J Med Chem 52: 891-903 (2009)
Article DOI: 10.1021/jm801296d
BindingDB Entry DOI: 10.7270/Q2TM7B3D
Orexin receptor type 1
(Homo sapiens (Human))
BDBM50136693
((+/-)-2-benzyl-1-(6,7-dimethoxy-3,4-dihydroisoquin...)
Show SMILES COc1cc2CCN(Cc2cc1OC)C(=O)C(Cc1ccccc1)C(C)(C)C
Show InChI InChI=1S/C24H31NO3/c1-24(2,3)20(13-17-9-7-6-8-10-17)23(26)25-12-11-18-14-21(27-4)22(28-5)15-19(18)16-25/h6-10,14-15,20H,11-13,16H2,1-5H3
Reactome pathway
n/an/a 5.50E+3n/an/an/an/an/an/a
Actelion Pharmaceuticals Ltd.
Curated by ChEMBL
Assay Description
Antagonist activity at human OX1 receptor
J Med Chem 52: 891-903 (2009)
Article DOI: 10.1021/jm801296d
BindingDB Entry DOI: 10.7270/Q2TM7B3D
Orexin receptor type 1
(Homo sapiens (Human))
BDBM50136693
((+/-)-2-benzyl-1-(6,7-dimethoxy-3,4-dihydroisoquin...)
Show SMILES COc1cc2CCN(Cc2cc1OC)C(=O)C(Cc1ccccc1)C(C)(C)C
Show InChI InChI=1S/C24H31NO3/c1-24(2,3)20(13-17-9-7-6-8-10-17)23(26)25-12-11-18-14-21(27-4)22(28-5)15-19(18)16-25/h6-10,14-15,20H,11-13,16H2,1-5H3
Reactome pathway
n/an/a 5.50E+3n/an/an/an/an/an/a
Banyu Tsukuba Research Institute
Curated by ChEMBL
Assay Description
Inhibitory concentration against human orexin-1 receptor (hOX1R)
Bioorg Med Chem Lett 13: 4497-9 (2003)
BindingDB Entry DOI: 10.7270/Q20R9NT7